kotlin.build CI

Trigger log

Every delivery GitHub sent and what this service did with it — including the ones that produced no build. Newest first.

WhenWhatRepositoryDetailWho
5m 36s ago build remote stopCodexCoder21Organization/AiCliHostSupervisorDaemonEmbeddedRemote stop attempt 12 for check run 123239182712 failed: foundation.url.protocol.sandbox.SandboxException: Sandboxed code threw an exception: java.lang.InternalError: Exception encountered in implementation of foundation/url/sjvm/intrinsics/ServiceBridge:rpc(Ljava/lang/String;Ljava/util/Map;)Ljava/util/Map; : foundation.url.resolver.UrlResolutionException: RPC request 'supersedeBuildRun' failed: RELAY_ERROR - Handler error: RPC error: INTERNAL_ERROR - Cannot supersede build run '7adb362a': it is already in terminal status COMPLETED. Only in-progress builds can be superseded. cause: null. The cancellation stays saved; retrying in 1920000ms.this service
16m 22s ago build remote stopCodexCoder21Organization/AiCliHostSupervisorDaemonEmbeddedRemote stop attempt 14 for check run 123138706939 failed: foundation.url.protocol.sandbox.SandboxException: Sandboxed code threw an exception: java.lang.InternalError: Exception encountered in implementation of foundation/url/sjvm/intrinsics/ServiceBridge:rpc(Ljava/lang/String;Ljava/util/Map;)Ljava/util/Map; : foundation.url.resolver.UrlResolutionException: RPC request 'supersedeBuildRun' failed: RELAY_ERROR - Handler error: RPC error: INTERNAL_ERROR - Cannot supersede build run 'bed8f131': it is already in terminal status FAILED. Only in-progress builds can be superseded. cause: null. The cancellation stays saved; retrying in 1920000ms.this service
21m 12s ago build remote stopCodexCoder21Organization/AiCliHostSupervisorDaemonEmbeddedRemote stop attempt 9 for check run 123302470327 failed: foundation.url.protocol.sandbox.SandboxException: Sandboxed code threw an exception: java.lang.InternalError: Exception encountered in implementation of foundation/url/sjvm/intrinsics/ServiceBridge:rpc(Ljava/lang/String;Ljava/util/Map;)Ljava/util/Map; : foundation.url.resolver.UrlResolutionException: RPC request 'supersedeBuildRun' failed: RELAY_ERROR - Handler error: RPC error: INTERNAL_ERROR - Cannot supersede build run 'e7c314f8': it is already in terminal status FAILED. Only in-progress builds can be superseded. cause: null. The cancellation stays saved; retrying in 1920000ms.this service
21m 12s ago build remote stopCodexCoder21Organization/AiCliHostSupervisorDaemonEmbeddedRemote stop attempt 13 for check run 123218537086 failed: foundation.url.protocol.sandbox.SandboxException: Sandboxed code threw an exception: java.lang.InternalError: Exception encountered in implementation of foundation/url/sjvm/intrinsics/ServiceBridge:rpc(Ljava/lang/String;Ljava/util/Map;)Ljava/util/Map; : foundation.url.resolver.UrlResolutionException: RPC request 'supersedeBuildRun' failed: RELAY_ERROR - Handler error: RPC error: INTERNAL_ERROR - Cannot supersede build run '04e84303': it is already in terminal status FAILED. Only in-progress builds can be superseded. cause: null. The cancellation stays saved; retrying in 1920000ms.this service
30m 18s ago build remote stopCodexCoder21Organization/AiCliHostSupervisorDaemonEmbeddedRemote stop attempt 11 for check run 123291765685 failed: foundation.url.protocol.sandbox.SandboxException: Sandboxed code threw an exception: java.lang.InternalError: Exception encountered in implementation of foundation/url/sjvm/intrinsics/ServiceBridge:rpc(Ljava/lang/String;Ljava/util/Map;)Ljava/util/Map; : foundation.url.resolver.UrlResolutionException: RPC request 'supersedeBuildRun' failed: RELAY_ERROR - Handler error: RPC error: INTERNAL_ERROR - Cannot supersede build run '8485074f': it is already in terminal status FAILED. Only in-progress builds can be superseded. cause: null. The cancellation stays saved; retrying in 1920000ms.this service
32m 44s ago build remote stopCodexCoder21Organization/AiCliHostSupervisorDaemonEmbeddedRemote stop attempt 10 for check run 123300877367 failed: foundation.url.protocol.sandbox.SandboxException: Sandboxed code threw an exception: java.lang.InternalError: Exception encountered in implementation of foundation/url/sjvm/intrinsics/ServiceBridge:rpc(Ljava/lang/String;Ljava/util/Map;)Ljava/util/Map; : foundation.url.resolver.UrlResolutionException: RPC request 'supersedeBuildRun' failed: RELAY_ERROR - Handler error: RPC error: INTERNAL_ERROR - Cannot supersede build run 'c0c01ba1': it is already in terminal status FAILED. Only in-progress builds can be superseded. cause: null. The cancellation stays saved; retrying in 1920000ms.this service
33m 10s ago build remote stopCodexCoder21Organization/AiCliHostSupervisorDaemonEmbeddedRemote stop attempt 10 for check run 123410651364 failed: foundation.url.protocol.sandbox.SandboxException: Sandboxed code threw an exception: java.lang.InternalError: Exception encountered in implementation of foundation/url/sjvm/intrinsics/ServiceBridge:rpc(Ljava/lang/String;Ljava/util/Map;)Ljava/util/Map; : foundation.url.resolver.UrlResolutionException: RPC request 'supersedeBuildRun' failed: RELAY_ERROR - Handler error: RPC error: INTERNAL_ERROR - Cannot supersede build run 'd40d269b': it is already in terminal status FAILED. Only in-progress builds can be superseded. cause: null. The cancellation stays saved; retrying in 1920000ms.this service
33m 59s ago build remote stopCodexCoder21Organization/AiCliHostSupervisorDaemonEmbeddedRemote stop attempt 14 for check run 123188549635 failed: foundation.url.protocol.sandbox.SandboxException: Sandboxed code threw an exception: java.lang.InternalError: Exception encountered in implementation of foundation/url/sjvm/intrinsics/ServiceBridge:rpc(Ljava/lang/String;Ljava/util/Map;)Ljava/util/Map; : foundation.url.resolver.UrlResolutionException: RPC request 'supersedeBuildRun' failed: RELAY_ERROR - Handler error: RPC error: INTERNAL_ERROR - Cannot supersede build run '4bff852d': it is already in terminal status FAILED. Only in-progress builds can be superseded. cause: null. The cancellation stays saved; retrying in 1920000ms.this service
55m 3s ago build remote stopCodexCoder21Organization/AiCliHostSupervisorDaemonEmbeddedRemote stop attempt 11 for check run 123239182712 failed: foundation.url.protocol.sandbox.SandboxException: Sandboxed code threw an exception: java.lang.InternalError: Exception encountered in implementation of foundation/url/sjvm/intrinsics/ServiceBridge:rpc(Ljava/lang/String;Ljava/util/Map;)Ljava/util/Map; : foundation.url.resolver.UrlResolutionException: RPC request 'supersedeBuildRun' failed: RELAY_ERROR - Handler error: RPC error: INTERNAL_ERROR - Cannot supersede build run '7adb362a': it is already in terminal status COMPLETED. Only in-progress builds can be superseded. cause: null. The cancellation stays saved; retrying in 1920000ms.this service
1h 5m ago build remote stopCodexCoder21Organization/AiCliHostSupervisorDaemonEmbeddedRemote stop attempt 13 for check run 123138706939 failed: foundation.url.protocol.sandbox.SandboxException: Sandboxed code threw an exception: java.lang.InternalError: Exception encountered in implementation of foundation/url/sjvm/intrinsics/ServiceBridge:rpc(Ljava/lang/String;Ljava/util/Map;)Ljava/util/Map; : foundation.url.resolver.UrlResolutionException: RPC request 'supersedeBuildRun' failed: RELAY_ERROR - Handler error: RPC error: INTERNAL_ERROR - Cannot supersede build run 'bed8f131': it is already in terminal status FAILED. Only in-progress builds can be superseded. cause: null. The cancellation stays saved; retrying in 1920000ms.this service
1h 14m ago build remote stopCodexCoder21Organization/AiCliHostSupervisorDaemonEmbeddedRemote stop attempt 12 for check run 123218537086 failed: foundation.url.protocol.sandbox.SandboxException: Sandboxed code threw an exception: java.lang.InternalError: Exception encountered in implementation of foundation/url/sjvm/intrinsics/ServiceBridge:rpc(Ljava/lang/String;Ljava/util/Map;)Ljava/util/Map; : foundation.url.resolver.UrlResolutionException: RPC request 'supersedeBuildRun' failed: RELAY_ERROR - Handler error: RPC error: INTERNAL_ERROR - Cannot supersede build run '04e84303': it is already in terminal status FAILED. Only in-progress builds can be superseded. cause: null. The cancellation stays saved; retrying in 1920000ms.this service
1h 15m ago build remote stopCodexCoder21Organization/AiCliHostSupervisorDaemonEmbeddedRemote stop attempt 8 for check run 123302470327 failed: foundation.url.protocol.sandbox.SandboxException: Sandboxed code threw an exception: java.lang.InternalError: Exception encountered in implementation of foundation/url/sjvm/intrinsics/ServiceBridge:rpc(Ljava/lang/String;Ljava/util/Map;)Ljava/util/Map; : foundation.url.resolver.UrlResolutionException: RPC request 'supersedeBuildRun' failed: RELAY_ERROR - Handler error: RPC error: INTERNAL_ERROR - Cannot supersede build run 'e7c314f8': it is already in terminal status FAILED. Only in-progress builds can be superseded. cause: null. The cancellation stays saved; retrying in 1920000ms.this service
1h 17m ago build remote stopCodexCoder21Organization/AiCliHostSupervisorDaemonEmbeddedRemote stop attempt 10 for check run 123291765685 failed: foundation.url.protocol.sandbox.SandboxException: Sandboxed code threw an exception: java.lang.InternalError: Exception encountered in implementation of foundation/url/sjvm/intrinsics/ServiceBridge:rpc(Ljava/lang/String;Ljava/util/Map;)Ljava/util/Map; : foundation.url.resolver.UrlResolutionException: RPC request 'supersedeBuildRun' failed: RELAY_ERROR - Handler error: RPC error: INTERNAL_ERROR - Cannot supersede build run '8485074f': it is already in terminal status FAILED. Only in-progress builds can be superseded. cause: null. The cancellation stays saved; retrying in 1920000ms.this service
1h 19m ago build remote stopCodexCoder21Organization/AiCliHostSupervisorDaemonEmbeddedRemote stop attempt 9 for check run 123300877367 failed: foundation.url.protocol.sandbox.SandboxException: Sandboxed code threw an exception: java.lang.InternalError: Exception encountered in implementation of foundation/url/sjvm/intrinsics/ServiceBridge:rpc(Ljava/lang/String;Ljava/util/Map;)Ljava/util/Map; : foundation.url.resolver.UrlResolutionException: RPC request 'supersedeBuildRun' failed: RELAY_ERROR - Handler error: RPC error: INTERNAL_ERROR - Cannot supersede build run 'c0c01ba1': it is already in terminal status FAILED. Only in-progress builds can be superseded. cause: null. The cancellation stays saved; retrying in 1920000ms.this service
1h 22m ago build remote stopCodexCoder21Organization/AiCliHostSupervisorDaemonEmbeddedRemote stop attempt 9 for check run 123410651364 failed: foundation.url.protocol.sandbox.SandboxException: Sandboxed code threw an exception: java.lang.InternalError: Exception encountered in implementation of foundation/url/sjvm/intrinsics/ServiceBridge:rpc(Ljava/lang/String;Ljava/util/Map;)Ljava/util/Map; : foundation.url.resolver.UrlResolutionException: RPC request 'supersedeBuildRun' failed: RELAY_ERROR - Handler error: RPC error: INTERNAL_ERROR - Cannot supersede build run 'd40d269b': it is already in terminal status FAILED. Only in-progress builds can be superseded. cause: null. The cancellation stays saved; retrying in 1920000ms.this service
1h 29m ago build remote stopCodexCoder21Organization/AiCliHostSupervisorDaemonEmbeddedRemote stop attempt 13 for check run 123188549635 failed: foundation.url.protocol.sandbox.SandboxException: Sandboxed code threw an exception: java.lang.InternalError: Exception encountered in implementation of foundation/url/sjvm/intrinsics/ServiceBridge:rpc(Ljava/lang/String;Ljava/util/Map;)Ljava/util/Map; : foundation.url.resolver.UrlResolutionException: RPC request 'supersedeBuildRun' failed: RELAY_ERROR - Handler error: RPC error: INTERNAL_ERROR - Cannot supersede build run '4bff852d': it is already in terminal status FAILED. Only in-progress builds can be superseded. cause: null. The cancellation stays saved; retrying in 1920000ms.this service
1h 46m ago build remote stopCodexCoder21Organization/AiCliHostSupervisorDaemonEmbeddedRemote stop attempt 10 for check run 123239182712 failed: foundation.url.protocol.sandbox.SandboxException: Sandboxed code threw an exception: java.lang.InternalError: Exception encountered in implementation of foundation/url/sjvm/intrinsics/ServiceBridge:rpc(Ljava/lang/String;Ljava/util/Map;)Ljava/util/Map; : foundation.url.resolver.UrlResolutionException: RPC request 'supersedeBuildRun' failed: RELAY_ERROR - Handler error: RPC error: INTERNAL_ERROR - Cannot supersede build run '7adb362a': it is already in terminal status COMPLETED. Only in-progress builds can be superseded. cause: null. The cancellation stays saved; retrying in 1920000ms.this service
1h 52m ago build remote stopCodexCoder21Organization/AiCliHostSupervisorDaemonEmbeddedRemote stop attempt 12 for check run 123138706939 failed: foundation.url.protocol.sandbox.SandboxException: Sandboxed code threw an exception: java.lang.InternalError: Exception encountered in implementation of foundation/url/sjvm/intrinsics/ServiceBridge:rpc(Ljava/lang/String;Ljava/util/Map;)Ljava/util/Map; : foundation.url.resolver.UrlResolutionException: RPC request 'supersedeBuildRun' failed: RELAY_ERROR - Handler error: RPC error: INTERNAL_ERROR - Cannot supersede build run 'bed8f131': it is already in terminal status FAILED. Only in-progress builds can be superseded. cause: null. The cancellation stays saved; retrying in 1920000ms.this service
2h 8m ago build remote stopCodexCoder21Organization/AiCliHostSupervisorDaemonEmbeddedRemote stop attempt 8 for check run 123300877367 failed: foundation.url.protocol.sandbox.SandboxException: Sandboxed code threw an exception: java.lang.InternalError: Exception encountered in implementation of foundation/url/sjvm/intrinsics/ServiceBridge:rpc(Ljava/lang/String;Ljava/util/Map;)Ljava/util/Map; : foundation.url.resolver.UrlResolutionException: RPC request 'supersedeBuildRun' failed: RELAY_ERROR - Handler error: RPC error: INTERNAL_ERROR - Cannot supersede build run 'c0c01ba1': it is already in terminal status FAILED. Only in-progress builds can be superseded. cause: null. The cancellation stays saved; retrying in 1920000ms.this service
2h 10m ago build remote stopCodexCoder21Organization/AiCliHostSupervisorDaemonEmbeddedRemote stop attempt 7 for check run 123302470327 failed: foundation.url.protocol.sandbox.SandboxException: Sandboxed code threw an exception: java.lang.InternalError: Exception encountered in implementation of foundation/url/sjvm/intrinsics/ServiceBridge:rpc(Ljava/lang/String;Ljava/util/Map;)Ljava/util/Map; : foundation.url.resolver.UrlResolutionException: RPC request 'supersedeBuildRun' failed: RELAY_ERROR - Handler error: RPC error: INTERNAL_ERROR - Cannot supersede build run 'e7c314f8': it is already in terminal status FAILED. Only in-progress builds can be superseded. cause: null. The cancellation stays saved; retrying in 1920000ms.this service
2h 11m ago build remote stopCodexCoder21Organization/AiCliHostSupervisorDaemonEmbeddedRemote stop attempt 8 for check run 123410651364 failed: foundation.url.protocol.sandbox.SandboxException: Sandboxed code threw an exception: java.lang.InternalError: Exception encountered in implementation of foundation/url/sjvm/intrinsics/ServiceBridge:rpc(Ljava/lang/String;Ljava/util/Map;)Ljava/util/Map; : foundation.url.resolver.UrlResolutionException: RPC request 'supersedeBuildRun' failed: RELAY_ERROR - Handler error: RPC error: INTERNAL_ERROR - Cannot supersede build run 'd40d269b': it is already in terminal status FAILED. Only in-progress builds can be superseded. cause: null. The cancellation stays saved; retrying in 1920000ms.this service
2h 14m ago build remote stopCodexCoder21Organization/AiCliHostSupervisorDaemonEmbeddedRemote stop attempt 9 for check run 123291765685 failed: foundation.url.protocol.sandbox.SandboxException: Sandboxed code threw an exception: java.lang.InternalError: Exception encountered in implementation of foundation/url/sjvm/intrinsics/ServiceBridge:rpc(Ljava/lang/String;Ljava/util/Map;)Ljava/util/Map; : foundation.url.resolver.UrlResolutionException: RPC request 'supersedeBuildRun' failed: RELAY_ERROR - Handler error: RPC error: INTERNAL_ERROR - Cannot supersede build run '8485074f': it is already in terminal status FAILED. Only in-progress builds can be superseded. cause: null. The cancellation stays saved; retrying in 1920000ms.this service
2h 14m ago build remote stopCodexCoder21Organization/AiCliHostSupervisorDaemonEmbeddedRemote stop attempt 11 for check run 123218537086 failed: foundation.url.protocol.sandbox.SandboxException: Sandboxed code threw an exception: java.lang.InternalError: Exception encountered in implementation of foundation/url/sjvm/intrinsics/ServiceBridge:rpc(Ljava/lang/String;Ljava/util/Map;)Ljava/util/Map; : foundation.url.resolver.UrlResolutionException: RPC request 'supersedeBuildRun' failed: RELAY_ERROR - Handler error: RPC error: INTERNAL_ERROR - Cannot supersede build run '04e84303': it is already in terminal status FAILED. Only in-progress builds can be superseded. cause: null. The cancellation stays saved; retrying in 1920000ms.this service
2h 21m ago build remote stopCodexCoder21Organization/AiCliHostSupervisorDaemonEmbeddedRemote stop attempt 12 for check run 123188549635 failed: foundation.url.protocol.sandbox.SandboxException: Sandboxed code threw an exception: java.lang.InternalError: Exception encountered in implementation of foundation/url/sjvm/intrinsics/ServiceBridge:rpc(Ljava/lang/String;Ljava/util/Map;)Ljava/util/Map; : foundation.url.resolver.UrlResolutionException: RPC request 'supersedeBuildRun' failed: RELAY_ERROR - Handler error: RPC error: INTERNAL_ERROR - Cannot supersede build run '4bff852d': it is already in terminal status FAILED. Only in-progress builds can be superseded. cause: null. The cancellation stays saved; retrying in 1920000ms.this service
2h 31m ago build remote stopCodexCoder21Organization/AiCliHostSupervisorDaemonEmbeddedRemote stop attempt 9 for check run 123239182712 failed: foundation.url.protocol.sandbox.SandboxException: Sandboxed code threw an exception: java.lang.InternalError: Exception encountered in implementation of foundation/url/sjvm/intrinsics/ServiceBridge:rpc(Ljava/lang/String;Ljava/util/Map;)Ljava/util/Map; : foundation.url.resolver.UrlResolutionException: RPC request 'supersedeBuildRun' failed: RELAY_ERROR - Handler error: RPC error: INTERNAL_ERROR - Cannot supersede build run '7adb362a': it is already in terminal status COMPLETED. Only in-progress builds can be superseded. cause: null. The cancellation stays saved; retrying in 1920000ms.this service
2h 37m ago build remote stopCodexCoder21Organization/AiCliHostSupervisorDaemonEmbeddedRemote stop attempt 11 for check run 123138706939 failed: foundation.url.protocol.sandbox.SandboxException: Sandboxed code threw an exception: java.lang.InternalError: Exception encountered in implementation of foundation/url/sjvm/intrinsics/ServiceBridge:rpc(Ljava/lang/String;Ljava/util/Map;)Ljava/util/Map; : foundation.url.resolver.UrlResolutionException: RPC request 'supersedeBuildRun' failed: RELAY_ERROR - Handler error: RPC error: INTERNAL_ERROR - Cannot supersede build run 'bed8f131': it is already in terminal status FAILED. Only in-progress builds can be superseded. cause: null. The cancellation stays saved; retrying in 1920000ms.this service
3h 0m ago build remote stopCodexCoder21Organization/AiCliHostSupervisorDaemonEmbeddedRemote stop attempt 7 for check run 123300877367 failed: foundation.url.protocol.sandbox.SandboxException: Sandboxed code threw an exception: java.lang.InternalError: Exception encountered in implementation of foundation/url/sjvm/intrinsics/ServiceBridge:rpc(Ljava/lang/String;Ljava/util/Map;)Ljava/util/Map; : foundation.url.resolver.UrlResolutionException: RPC request 'supersedeBuildRun' failed: RELAY_ERROR - Handler error: RPC error: INTERNAL_ERROR - Cannot supersede build run 'c0c01ba1': it is already in terminal status FAILED. Only in-progress builds can be superseded. cause: null. The cancellation stays saved; retrying in 1920000ms.this service
3h 0m ago build remote stopCodexCoder21Organization/AiCliHostSupervisorDaemonEmbeddedRemote stop attempt 10 for check run 123218537086 failed: foundation.url.protocol.sandbox.SandboxException: Sandboxed code threw an exception: java.lang.InternalError: Exception encountered in implementation of foundation/url/sjvm/intrinsics/ServiceBridge:rpc(Ljava/lang/String;Ljava/util/Map;)Ljava/util/Map; : foundation.url.resolver.UrlResolutionException: RPC request 'supersedeBuildRun' failed: RELAY_ERROR - Handler error: RPC error: INTERNAL_ERROR - Cannot supersede build run '04e84303': it is already in terminal status FAILED. Only in-progress builds can be superseded. cause: null. The cancellation stays saved; retrying in 1920000ms.this service
3h 1m ago build remote stopCodexCoder21Organization/AiCliHostSupervisorDaemonEmbeddedRemote stop attempt 7 for check run 123410651364 failed: foundation.url.protocol.sandbox.SandboxException: Sandboxed code threw an exception: java.lang.InternalError: Exception encountered in implementation of foundation/url/sjvm/intrinsics/ServiceBridge:rpc(Ljava/lang/String;Ljava/util/Map;)Ljava/util/Map; : foundation.url.resolver.UrlResolutionException: RPC request 'supersedeBuildRun' failed: RELAY_ERROR - Handler error: RPC error: INTERNAL_ERROR - Cannot supersede build run 'd40d269b': it is already in terminal status FAILED. Only in-progress builds can be superseded. cause: null. The cancellation stays saved; retrying in 1920000ms.this service
3h 7m ago build remote stopCodexCoder21Organization/AiCliHostSupervisorDaemonEmbeddedRemote stop attempt 6 for check run 123302470327 failed: foundation.url.protocol.sandbox.SandboxException: Sandboxed code threw an exception: java.lang.InternalError: Exception encountered in implementation of foundation/url/sjvm/intrinsics/ServiceBridge:rpc(Ljava/lang/String;Ljava/util/Map;)Ljava/util/Map; : foundation.url.resolver.UrlResolutionException: RPC request 'supersedeBuildRun' failed: RELAY_ERROR - Handler error: RPC error: INTERNAL_ERROR - Cannot supersede build run 'e7c314f8': it is already in terminal status FAILED. Only in-progress builds can be superseded. cause: null. The cancellation stays saved; retrying in 1920000ms.this service
3h 7m ago build remote stopCodexCoder21Organization/AiCliHostSupervisorDaemonEmbeddedRemote stop attempt 8 for check run 123291765685 failed: foundation.url.protocol.sandbox.SandboxException: Sandboxed code threw an exception: java.lang.InternalError: Exception encountered in implementation of foundation/url/sjvm/intrinsics/ServiceBridge:rpc(Ljava/lang/String;Ljava/util/Map;)Ljava/util/Map; : foundation.url.resolver.UrlResolutionException: RPC request 'supersedeBuildRun' failed: RELAY_ERROR - Handler error: RPC error: INTERNAL_ERROR - Cannot supersede build run '8485074f': it is already in terminal status FAILED. Only in-progress builds can be superseded. cause: null. The cancellation stays saved; retrying in 1920000ms.this service
3h 12m ago build remote stopCodexCoder21Organization/AiCliHostSupervisorDaemonEmbeddedRemote stop attempt 11 for check run 123188549635 failed: foundation.url.protocol.sandbox.SandboxException: Sandboxed code threw an exception: java.lang.InternalError: Exception encountered in implementation of foundation/url/sjvm/intrinsics/ServiceBridge:rpc(Ljava/lang/String;Ljava/util/Map;)Ljava/util/Map; : foundation.url.resolver.UrlResolutionException: RPC request 'supersedeBuildRun' failed: RELAY_ERROR - Handler error: RPC error: INTERNAL_ERROR - Cannot supersede build run '4bff852d': it is already in terminal status FAILED. Only in-progress builds can be superseded. cause: null. The cancellation stays saved; retrying in 1920000ms.this service
3h 18m ago build remote stopCodexCoder21Organization/AiCliHostSupervisorDaemonEmbeddedRemote stop attempt 8 for check run 123239182712 failed: foundation.url.protocol.sandbox.SandboxException: Sandboxed code threw an exception: java.lang.InternalError: Exception encountered in implementation of foundation/url/sjvm/intrinsics/ServiceBridge:rpc(Ljava/lang/String;Ljava/util/Map;)Ljava/util/Map; : foundation.url.resolver.UrlResolutionException: RPC request 'supersedeBuildRun' failed: RELAY_ERROR - Handler error: RPC error: INTERNAL_ERROR - Cannot supersede build run '7adb362a': it is already in terminal status COMPLETED. Only in-progress builds can be superseded. cause: null. The cancellation stays saved; retrying in 1920000ms.this service
3h 25m ago build remote stopCodexCoder21Organization/AiCliHostSupervisorDaemonEmbeddedRemote stop attempt 10 for check run 123138706939 failed: foundation.url.protocol.sandbox.SandboxException: Sandboxed code threw an exception: java.lang.InternalError: Exception encountered in implementation of foundation/url/sjvm/intrinsics/ServiceBridge:rpc(Ljava/lang/String;Ljava/util/Map;)Ljava/util/Map; : foundation.url.resolver.UrlResolutionException: RPC request 'supersedeBuildRun' failed: INTERNAL_ERROR - RPC error: INTERNAL_ERROR - Cannot supersede build run 'bed8f131': it is already in terminal status FAILED. Only in-progress builds can be superseded. cause: null. The cancellation stays saved; retrying in 1920000ms.this service
3h 40m ago build recovery failedCodexCoder21Organization/AiCliHostSupervisorDaemonEmbeddedFailed to recover shadow check 123503785909: foundation.url.protocol.sandbox.SandboxException: Sandboxed code threw an exception: java.lang.InternalError: Exception encountered in implementation of foundation/url/sjvm/intrinsics/ServiceBridge:rpc(Ljava/lang/String;Ljava/util/Map;)Ljava/util/Map; : foundation.url.resolver.UrlResolutionException: RPC request 'cancelCiBuild' failed: INTERNAL_ERROR - RPC error: -1 - IllegalStateException: Cannot run CI operation 'cancelCiBuild' because the url://buildtest/ connection has not been established, and it did not come up within 20000ms of waiting. Retry once the server logs 'url://buildtest/ connection established; ingestion and CI orchestration enabled.' cause: null at foundation.url.resolver.sandbox.TypeMarshaling.fromJvmResult$foundation_url_resolver_sandbox(TypeMarshaling.kt:692) at foundation.url.resolver.sandbox.InstanceMethodDispatcher$invokeWithActivity$3.invoke(SandboxedProxyGenerator.kt:2106) at foundation.url.resolver.sandbox.InstanceMethodDispatcher$invokeWithActivity$3.invoke(SandboxedProxyGenerator.kt:2037) at foundation.url.resolver.sandbox.SandboxedProxyGeneratorKt$invokeSandboxMethod$future$1$result$1.invoke(SandboxedProxyGenerator.kt:1491) at community.kotlin.clocks.hierarchical.RequiredClockPadKt.withRequiredClockPad(RequiredClockPad.kt:89) at foundation.url.resolver.sandbox.SandboxedProxyGeneratorKt.invokeSandboxMethod$lambda$4(SandboxedProxyGenerator.kt:1491) at java.base/java.util.concurrent.FutureTask.run(FutureTask.java:317) at foundation.url.resolver.sandbox.SandboxInvocationLane.runScheduled(SandboxedProxyGenerator.kt:1379) at foundation.url.resolver.sandbox.SandboxInvocationLane.schedule$lambda$5(SandboxedProxyGenerator.kt:1370) at java.base/java.util.concurrent.ThreadPoolExecutor.runWorker(ThreadPoolExecutor.java:1144) at java.base/java.util.concurrent.ThreadPoolExecutor$Worker.run(ThreadPoolExecutor.java:642) at java.base/java.lang.Thread.run(Thread.java:1583) Suppressed: foundation.url.protocol.sandbox.SandboxException: Sandboxed code threw an exception: java.lang.InternalError: Exception encountered in implementation of foundation/url/sjvm/intrinsics/ServiceBridge:rpc(Ljava/lang/String;Ljava/util/Map;)Ljava/util/Map; : foundation.url.resolver.UrlResolutionException: RPC request 'getCiBuild' failed: INTERNAL_ERROR - RPC error: -1 - IllegalStateException: Cannot run CI operation 'getCiBuild' because the url://buildtest/ connection has not been established, and it did not come up within 20000ms of waiting. Retry once the server logs 'url://buildtest/ connection established; ingestion and CI orchestration enabled.' cause: null ... 12 more Caused by: java.lang.RuntimeException: java.lang.InternalError: Exception encountered in implementation of foundation/url/sjvm/intrinsics/ServiceBridge:rpc(Ljava/lang/String;Ljava/util/Map;)Ljava/util/Map; : foundation.url.resolver.UrlResolutionException: RPC request 'getCiBuild' failed: INTERNAL_ERROR - RPC error: -1 - IllegalStateException: Cannot run CI operation 'getCiBuild' because the url://buildtest/ connection has not been established, and it did not come up within 20000ms of waiting. Retry once the server logs 'url://buildtest/ connection established; ingestion and CI orchestration enabled.' at foundation.url.resolver.sandbox.TypeMarshaling.fromJvmResult$foundation_url_resolver_sandbox(TypeMarshaling.kt:695) ... 11 more Suppressed: java.lang.IllegalStateException: Remote termination proof read failed for check run 123503785909, remote run b9dc6483-8e3b-40ea-83d2-d15ef1dae539, attempt generation 0; expected reason="build exceeded its overall deadline while deferred", bypassMessage=null, conclusion="failure", summary="Build never started because the runner was saturated: every build worker was already running a check. It waited 140488s in the deferred queue before the existing local deferred-submission deadline expired.\n\nBuild exceeded its local deferred-submission deadline of 180 minutes after 147668s elapsed since submission. No remote buildtest run was admitted. The local queue deadline survives service restarts.", operationMode=LOCAL_RESULT, proof any terminal status. The remote operation failed with foundation.url.protocol.sandbox.SandboxException: Sandboxed code threw an exception: java.lang.InternalError: Exception encountered in implementation of foundation/url/sjvm/intrinsics/ServiceBridge:rpc(Ljava/lang/String;Ljava/util/Map;)Ljava/util/Map; : foundation.url.resolver.UrlResolutionException: RPC request 'cancelCiBuild' failed: INTERNAL_ERROR - RPC error: -1 - IllegalStateException: Cannot run CI operation 'cancelCiBuild' because the url://buildtest/ connection has not been established, and it did not come up within 20000ms of waiting. Retry once the server logs 'url://buildtest/ connection established; ingestion and CI orchestration enabled.' cause: null; getBuildRun then failed with foundation.url.protocol.sandbox.SandboxException: Sandboxed code threw an exception: java.lang.InternalError: Exception encountered in implementation of foundation/url/sjvm/intrinsics/ServiceBridge:rpc(Ljava/lang/String;Ljava/util/Map;)Ljava/util/Map; : foundation.url.resolver.UrlResolutionException: RPC request 'getCiBuild' failed: INTERNAL_ERROR - RPC error: -1 - IllegalStateException: Cannot run CI operation 'getCiBuild' because the url://buildtest/ connection has not been established, and it did not come up within 20000ms of waiting. Retry once the server logs 'url://buildtest/ connection established; ingestion and CI orchestration enabled.' cause: null. at org.example.ci.BuildRunner.reconcileRemoteRunTermination(BuildRunner.kt:4204) at org.example.ci.BuildRunner.requestRemoteRunTermination(BuildRunner.kt:4026) at org.example.ci.BuildRunner.requestRemoteRunTermination$default(BuildRunner.kt:4002) at org.example.ci.BuildRunner.cancelAllRemoteRuns(BuildRunner.kt:3961) at org.example.ci.BuildRunner.cancelAllRemoteRuns$default(BuildRunner.kt:3882) at org.example.ci.BuildRunner.cancelBuildsForRepo$lambda$251(BuildRunner.kt:5802) at org.example.ci.BuildRunner.withCheckOperation(BuildRunner.kt:2143) at org.example.ci.BuildRunner.cancelBuildsForRepo(BuildRunner.kt:5668) at org.example.ci.BuildRunner.cancelBuildsForRepo$default(BuildRunner.kt:5362) at org.example.ci.BuildRunner.cancelRemoteRunsBeforeOwnedCompletion(BuildRunner.kt:5307) at org.example.ci.BuildRunner.cancelRemoteRunsBeforeOwnedCompletion$default(BuildRunner.kt:5251) at org.example.ci.BuildRunner.completeDeferredDeadline(BuildRunner.kt:4675) at org.example.ci.BuildRunner.resumeBuildAsRecovery(BuildRunner.kt:8057) at org.example.ci.BuildRunner.resumeBuildAsRecovery$default(BuildRunner.kt:7853) at org.example.ci.BuildRunner.resumeBuildWithOutcome$lambda$331(BuildRunner.kt:7843) at org.example.ci.BuildRunner.withSandboxRpcWorkClass(BuildRunner.kt:2447) at org.example.ci.BuildRunner.resumeBuildWithOutcome(BuildRunner.kt:7797) at org.example.ci.BuildRunner.resumeBuildWithOutcome$default(BuildRunner.kt:7797) at org.example.ci.BuildRunner.resumeBuild$org_example_ci(BuildRunner.kt:7796) at org.example.ci.BuildRunner.recoverPersistedDeferredBuilds(BuildRunner.kt:3877) at org.example.ci.CiServiceStartup.recoverBuilds(CiServiceStartup.kt:91) at org.example.ci.CiServiceAssembly.start$lambda$3(Main.kt:1009) at org.example.ci.CiServiceStartup.start(CiServiceStartup.kt:80) at org.example.ci.CiServiceAssembly.start(Main.kt:1059) at org.example.ci.MainKt.main(Main.kt:810) at org.example.ci.MainKt.main(Main.kt) Caused by: java.lang.RuntimeException: java.lang.InternalError: Exception encountered in implementation of foundation/url/sjvm/intrinsics/ServiceBridge:rpc(Ljava/lang/String;Ljava/util/Map;)Ljava/util/Map; : foundation.url.resolver.UrlResolutionException: RPC request 'cancelCiBuild' failed: INTERNAL_ERROR - RPC error: -1 - IllegalStateException: Cannot run CI operation 'cancelCiBuild' because the url://buildtest/ connection has not been established, and it did not come up within 20000ms of waiting. Retry once the server logs 'url://buildtest/ connection established; ingestion and CI orchestration enabled.' at foundation.url.resolver.sandbox.TypeMarshaling.fromJvmResult$foundation_url_resolver_sandbox(TypeMarshaling.kt:695) ... 11 more this service
3h 47m ago build remote stopCodexCoder21Organization/AiCliHostSupervisorDaemonEmbeddedRemote stop attempt 5 for check run 123302470327 failed: foundation.url.protocol.sandbox.SandboxException: Sandboxed code threw an exception: java.lang.InternalError: Exception encountered in implementation of foundation/url/sjvm/intrinsics/ServiceBridge:rpc(Ljava/lang/String;Ljava/util/Map;)Ljava/util/Map; : foundation.url.resolver.UrlResolutionException: RPC request 'supersedeBuildRun' failed: INTERNAL_ERROR - RPC error: INTERNAL_ERROR - Cannot supersede build run 'e7c314f8': it is already in terminal status FAILED. Only in-progress builds can be superseded. cause: null. The cancellation stays saved; retrying in 960000ms.this service
3h 51m ago build remote stopCodexCoder21Organization/AiCliHostSupervisorDaemonEmbeddedRemote stop attempt 6 for check run 123410651364 failed: foundation.url.protocol.sandbox.SandboxException: Sandboxed code threw an exception: java.lang.InternalError: Exception encountered in implementation of foundation/url/sjvm/intrinsics/ServiceBridge:rpc(Ljava/lang/String;Ljava/util/Map;)Ljava/util/Map; : foundation.url.resolver.UrlResolutionException: RPC request 'supersedeBuildRun' failed: INTERNAL_ERROR - RPC error: INTERNAL_ERROR - Cannot supersede build run 'd40d269b': it is already in terminal status FAILED. Only in-progress builds can be superseded. cause: null. The cancellation stays saved; retrying in 1920000ms.this service
3h 52m ago build remote stopCodexCoder21Organization/AiCliHostSupervisorDaemonEmbeddedRemote stop attempt 7 for check run 123291765685 failed: foundation.url.protocol.sandbox.SandboxException: Sandboxed code threw an exception: java.lang.InternalError: Exception encountered in implementation of foundation/url/sjvm/intrinsics/ServiceBridge:rpc(Ljava/lang/String;Ljava/util/Map;)Ljava/util/Map; : foundation.url.resolver.UrlResolutionException: RPC request 'supersedeBuildRun' failed: INTERNAL_ERROR - RPC error: INTERNAL_ERROR - Cannot supersede build run '8485074f': it is already in terminal status FAILED. Only in-progress builds can be superseded. cause: null. The cancellation stays saved; retrying in 1920000ms.this service
3h 54m ago build remote stopCodexCoder21Organization/AiCliHostSupervisorDaemonEmbeddedRemote stop attempt 9 for check run 123218537086 failed: foundation.url.protocol.sandbox.SandboxException: Sandboxed code threw an exception: java.lang.InternalError: Exception encountered in implementation of foundation/url/sjvm/intrinsics/ServiceBridge:rpc(Ljava/lang/String;Ljava/util/Map;)Ljava/util/Map; : foundation.url.resolver.UrlResolutionException: RPC request 'supersedeBuildRun' failed: INTERNAL_ERROR - RPC error: INTERNAL_ERROR - Cannot supersede build run '04e84303': it is already in terminal status FAILED. Only in-progress builds can be superseded. cause: null. The cancellation stays saved; retrying in 1920000ms.this service
3h 56m ago build remote stopCodexCoder21Organization/AiCliHostSupervisorDaemonEmbeddedRemote stop attempt 6 for check run 123300877367 failed: foundation.url.protocol.sandbox.SandboxException: Sandboxed code threw an exception: java.lang.InternalError: Exception encountered in implementation of foundation/url/sjvm/intrinsics/ServiceBridge:rpc(Ljava/lang/String;Ljava/util/Map;)Ljava/util/Map; : foundation.url.resolver.UrlResolutionException: RPC request 'supersedeBuildRun' failed: INTERNAL_ERROR - RPC error: INTERNAL_ERROR - Cannot supersede build run 'c0c01ba1': it is already in terminal status FAILED. Only in-progress builds can be superseded. cause: null. The cancellation stays saved; retrying in 1920000ms.this service
4h 0m ago build remote stopCodexCoder21Organization/AiCliHostSupervisorDaemonEmbeddedRemote stop attempt 10 for check run 123188549635 failed: foundation.url.protocol.sandbox.SandboxException: Sandboxed code threw an exception: java.lang.InternalError: Exception encountered in implementation of foundation/url/sjvm/intrinsics/ServiceBridge:rpc(Ljava/lang/String;Ljava/util/Map;)Ljava/util/Map; : foundation.url.resolver.UrlResolutionException: RPC request 'supersedeBuildRun' failed: INTERNAL_ERROR - RPC error: INTERNAL_ERROR - Cannot supersede build run '4bff852d': it is already in terminal status FAILED. Only in-progress builds can be superseded. cause: null. The cancellation stays saved; retrying in 1920000ms.this service
4h 6m ago build remote stopCodexCoder21Organization/AiCliHostSupervisorDaemonEmbeddedRemote stop attempt 4 for check run 123302470327 failed: foundation.url.protocol.sandbox.SandboxException: Sandboxed code threw an exception: java.lang.InternalError: Exception encountered in implementation of foundation/url/sjvm/intrinsics/ServiceBridge:rpc(Ljava/lang/String;Ljava/util/Map;)Ljava/util/Map; : foundation.url.resolver.UrlResolutionException: RPC request 'supersedeBuildRun' failed: INTERNAL_ERROR - RPC error: INTERNAL_ERROR - Cannot supersede build run 'e7c314f8': it is already in terminal status FAILED. Only in-progress builds can be superseded. cause: null. The cancellation stays saved; retrying in 480000ms.this service
4h 7m ago build remote stopCodexCoder21Organization/AiCliHostSupervisorDaemonEmbeddedRemote stop attempt 7 for check run 123239182712 failed: foundation.url.protocol.sandbox.SandboxException: Sandboxed code threw an exception: java.lang.InternalError: Exception encountered in implementation of foundation/url/sjvm/intrinsics/ServiceBridge:rpc(Ljava/lang/String;Ljava/util/Map;)Ljava/util/Map; : foundation.url.resolver.UrlResolutionException: RPC request 'supersedeBuildRun' failed: INTERNAL_ERROR - RPC error: INTERNAL_ERROR - Cannot supersede build run '7adb362a': it is already in terminal status COMPLETED. Only in-progress builds can be superseded. cause: null. The cancellation stays saved; retrying in 1920000ms.this service
4h 12m ago build remote stopCodexCoder21Organization/AiCliHostSupervisorDaemonEmbeddedRemote stop attempt 9 for check run 123138706939 failed: foundation.url.protocol.sandbox.SandboxException: Sandboxed code threw an exception: java.lang.InternalError: Exception encountered in implementation of foundation/url/sjvm/intrinsics/ServiceBridge:rpc(Ljava/lang/String;Ljava/util/Map;)Ljava/util/Map; : foundation.url.resolver.UrlResolutionException: RPC request 'supersedeBuildRun' failed: INTERNAL_ERROR - RPC error: INTERNAL_ERROR - Cannot supersede build run 'bed8f131': it is already in terminal status FAILED. Only in-progress builds can be superseded. cause: null. The cancellation stays saved; retrying in 1920000ms.this service
4h 21m ago build recovery failedCodexCoder21Organization/AiCliHostSupervisorDaemonEmbeddedFailed to recover shadow check 123496040152: foundation.url.protocol.sandbox.SandboxException: Sandboxed code threw an exception: java.lang.InternalError: Exception encountered in implementation of foundation/url/sjvm/intrinsics/ServiceBridge:rpc(Ljava/lang/String;Ljava/util/Map;)Ljava/util/Map; : foundation.url.resolver.UrlResolutionException: RPC request 'cancelCiBuild' failed: INTERNAL_ERROR - RPC error: -1 - IllegalStateException: Cannot run CI operation 'cancelCiBuild' because the url://buildtest/ connection has not been established, and it did not come up within 20000ms of waiting. Retry once the server logs 'url://buildtest/ connection established; ingestion and CI orchestration enabled.' cause: null at foundation.url.resolver.sandbox.TypeMarshaling.fromJvmResult$foundation_url_resolver_sandbox(TypeMarshaling.kt:692) at foundation.url.resolver.sandbox.InstanceMethodDispatcher$invokeWithActivity$3.invoke(SandboxedProxyGenerator.kt:2106) at foundation.url.resolver.sandbox.InstanceMethodDispatcher$invokeWithActivity$3.invoke(SandboxedProxyGenerator.kt:2037) at foundation.url.resolver.sandbox.SandboxedProxyGeneratorKt$invokeSandboxMethod$future$1$result$1.invoke(SandboxedProxyGenerator.kt:1491) at community.kotlin.clocks.hierarchical.RequiredClockPadKt.withRequiredClockPad(RequiredClockPad.kt:89) at foundation.url.resolver.sandbox.SandboxedProxyGeneratorKt.invokeSandboxMethod$lambda$4(SandboxedProxyGenerator.kt:1491) at java.base/java.util.concurrent.FutureTask.run(FutureTask.java:317) at foundation.url.resolver.sandbox.SandboxInvocationLane.runScheduled(SandboxedProxyGenerator.kt:1379) at foundation.url.resolver.sandbox.SandboxInvocationLane.schedule$lambda$5(SandboxedProxyGenerator.kt:1370) at java.base/java.util.concurrent.ThreadPoolExecutor.runWorker(ThreadPoolExecutor.java:1144) at java.base/java.util.concurrent.ThreadPoolExecutor$Worker.run(ThreadPoolExecutor.java:642) at java.base/java.lang.Thread.run(Thread.java:1583) Suppressed: foundation.url.protocol.sandbox.SandboxException: Sandboxed code threw an exception: java.lang.InternalError: Exception encountered in implementation of foundation/url/sjvm/intrinsics/ServiceBridge:rpc(Ljava/lang/String;Ljava/util/Map;)Ljava/util/Map; : foundation.url.resolver.UrlResolutionException: RPC request 'getCiBuild' failed: INTERNAL_ERROR - RPC error: -1 - IllegalStateException: Cannot run CI operation 'getCiBuild' because the url://buildtest/ connection has not been established, and it did not come up within 20000ms of waiting. Retry once the server logs 'url://buildtest/ connection established; ingestion and CI orchestration enabled.' cause: null ... 12 more Caused by: java.lang.RuntimeException: java.lang.InternalError: Exception encountered in implementation of foundation/url/sjvm/intrinsics/ServiceBridge:rpc(Ljava/lang/String;Ljava/util/Map;)Ljava/util/Map; : foundation.url.resolver.UrlResolutionException: RPC request 'getCiBuild' failed: INTERNAL_ERROR - RPC error: -1 - IllegalStateException: Cannot run CI operation 'getCiBuild' because the url://buildtest/ connection has not been established, and it did not come up within 20000ms of waiting. Retry once the server logs 'url://buildtest/ connection established; ingestion and CI orchestration enabled.' at foundation.url.resolver.sandbox.TypeMarshaling.fromJvmResult$foundation_url_resolver_sandbox(TypeMarshaling.kt:695) ... 11 more Suppressed: java.lang.IllegalStateException: Remote termination proof read failed for check run 123496040152, remote run 38e1ee75-5036-4e58-843c-ac431660f256, attempt generation 0; expected reason="build exceeded its overall deadline while deferred", bypassMessage=null, conclusion="failure", summary="Build never started because the runner was saturated: every build worker was already running a check. It waited 138122s in the deferred queue before the existing local deferred-submission deadline expired.\n\nBuild exceeded its local deferred-submission deadline of 180 minutes after 146111s elapsed since submission. No remote buildtest run was admitted. The local queue deadline survives service restarts.", operationMode=LOCAL_RESULT, proof any terminal status. The remote operation failed with foundation.url.protocol.sandbox.SandboxException: Sandboxed code threw an exception: java.lang.InternalError: Exception encountered in implementation of foundation/url/sjvm/intrinsics/ServiceBridge:rpc(Ljava/lang/String;Ljava/util/Map;)Ljava/util/Map; : foundation.url.resolver.UrlResolutionException: RPC request 'cancelCiBuild' failed: INTERNAL_ERROR - RPC error: -1 - IllegalStateException: Cannot run CI operation 'cancelCiBuild' because the url://buildtest/ connection has not been established, and it did not come up within 20000ms of waiting. Retry once the server logs 'url://buildtest/ connection established; ingestion and CI orchestration enabled.' cause: null; getBuildRun then failed with foundation.url.protocol.sandbox.SandboxException: Sandboxed code threw an exception: java.lang.InternalError: Exception encountered in implementation of foundation/url/sjvm/intrinsics/ServiceBridge:rpc(Ljava/lang/String;Ljava/util/Map;)Ljava/util/Map; : foundation.url.resolver.UrlResolutionException: RPC request 'getCiBuild' failed: INTERNAL_ERROR - RPC error: -1 - IllegalStateException: Cannot run CI operation 'getCiBuild' because the url://buildtest/ connection has not been established, and it did not come up within 20000ms of waiting. Retry once the server logs 'url://buildtest/ connection established; ingestion and CI orchestration enabled.' cause: null. at org.example.ci.BuildRunner.reconcileRemoteRunTermination(BuildRunner.kt:4204) at org.example.ci.BuildRunner.requestRemoteRunTermination(BuildRunner.kt:4026) at org.example.ci.BuildRunner.requestRemoteRunTermination$default(BuildRunner.kt:4002) at org.example.ci.BuildRunner.cancelAllRemoteRuns(BuildRunner.kt:3961) at org.example.ci.BuildRunner.cancelAllRemoteRuns$default(BuildRunner.kt:3882) at org.example.ci.BuildRunner.cancelBuildsForRepo$lambda$251(BuildRunner.kt:5802) at org.example.ci.BuildRunner.withCheckOperation(BuildRunner.kt:2143) at org.example.ci.BuildRunner.cancelBuildsForRepo(BuildRunner.kt:5668) at org.example.ci.BuildRunner.cancelBuildsForRepo$default(BuildRunner.kt:5362) at org.example.ci.BuildRunner.cancelRemoteRunsBeforeOwnedCompletion(BuildRunner.kt:5307) at org.example.ci.BuildRunner.cancelRemoteRunsBeforeOwnedCompletion$default(BuildRunner.kt:5251) at org.example.ci.BuildRunner.completeDeferredDeadline(BuildRunner.kt:4675) at org.example.ci.BuildRunner.resumeBuildAsRecovery(BuildRunner.kt:8057) at org.example.ci.BuildRunner.resumeBuildAsRecovery$default(BuildRunner.kt:7853) at org.example.ci.BuildRunner.resumeBuildWithOutcome$lambda$331(BuildRunner.kt:7843) at org.example.ci.BuildRunner.withSandboxRpcWorkClass(BuildRunner.kt:2447) at org.example.ci.BuildRunner.resumeBuildWithOutcome(BuildRunner.kt:7797) at org.example.ci.BuildRunner.resumeBuildWithOutcome$default(BuildRunner.kt:7797) at org.example.ci.BuildRunner.resumeBuild$org_example_ci(BuildRunner.kt:7796) at org.example.ci.BuildRunner.recoverPersistedDeferredBuilds(BuildRunner.kt:3877) at org.example.ci.CiServiceStartup.recoverBuilds(CiServiceStartup.kt:91) at org.example.ci.CiServiceAssembly.start$lambda$3(Main.kt:1009) at org.example.ci.CiServiceStartup.start(CiServiceStartup.kt:80) at org.example.ci.CiServiceAssembly.start(Main.kt:1059) at org.example.ci.MainKt.main(Main.kt:810) at org.example.ci.MainKt.main(Main.kt) Caused by: java.lang.RuntimeException: java.lang.InternalError: Exception encountered in implementation of foundation/url/sjvm/intrinsics/ServiceBridge:rpc(Ljava/lang/String;Ljava/util/Map;)Ljava/util/Map; : foundation.url.resolver.UrlResolutionException: RPC request 'cancelCiBuild' failed: INTERNAL_ERROR - RPC error: -1 - IllegalStateException: Cannot run CI operation 'cancelCiBuild' because the url://buildtest/ connection has not been established, and it did not come up within 20000ms of waiting. Retry once the server logs 'url://buildtest/ connection established; ingestion and CI orchestration enabled.' at foundation.url.resolver.sandbox.TypeMarshaling.fromJvmResult$foundation_url_resolver_sandbox(TypeMarshaling.kt:695) ... 11 more this service
4h 23m ago build remote stopCodexCoder21Organization/AiCliHostSupervisorDaemonEmbeddedRemote stop attempt 5 for check run 123300877367 failed: foundation.url.protocol.sandbox.SandboxException: Sandboxed code threw an exception: java.lang.InternalError: Exception encountered in implementation of foundation/url/sjvm/intrinsics/ServiceBridge:rpc(Ljava/lang/String;Ljava/util/Map;)Ljava/util/Map; : foundation.url.resolver.UrlResolutionException: RPC request 'supersedeBuildRun' failed: INTERNAL_ERROR - RPC error: INTERNAL_ERROR - Cannot supersede build run 'c0c01ba1': it is already in terminal status FAILED. Only in-progress builds can be superseded. cause: null. The cancellation stays saved; retrying in 960000ms.this service
5h 16m ago build remote stopCodexCoder21Organization/AiCliHostSupervisorDaemonEmbeddedRemote stop attempt 6 for check run 123291765685 failed: foundation.url.protocol.sandbox.SandboxException: Sandboxed code threw an exception: java.lang.InternalError: Exception encountered in implementation of foundation/url/sjvm/intrinsics/ServiceBridge:rpc(Ljava/lang/String;Ljava/util/Map;)Ljava/util/Map; : foundation.url.resolver.UrlResolutionException: RPC request 'supersedeBuildRun' failed: INTERNAL_ERROR - RPC error: INTERNAL_ERROR - Cannot supersede build run '8485074f': it is already in terminal status FAILED. Only in-progress builds can be superseded. cause: null. The cancellation stays saved; retrying in 1920000ms.this service
5h 16m ago build remote stopCodexCoder21Organization/AiCliHostSupervisorDaemonEmbeddedRemote stop attempt 8 for check run 123218537086 failed: foundation.url.protocol.sandbox.SandboxException: Sandboxed code threw an exception: java.lang.InternalError: Exception encountered in implementation of foundation/url/sjvm/intrinsics/ServiceBridge:rpc(Ljava/lang/String;Ljava/util/Map;)Ljava/util/Map; : foundation.url.resolver.UrlResolutionException: RPC request 'supersedeBuildRun' failed: INTERNAL_ERROR - RPC error: INTERNAL_ERROR - Cannot supersede build run '04e84303': it is already in terminal status FAILED. Only in-progress builds can be superseded. cause: null. The cancellation stays saved; retrying in 1920000ms.this service
5h 22m ago build remote stopCodexCoder21Organization/AiCliHostSupervisorDaemonEmbeddedRemote stop attempt 9 for check run 123188549635 failed: foundation.url.protocol.sandbox.SandboxException: Sandboxed code threw an exception: java.lang.InternalError: Exception encountered in implementation of foundation/url/sjvm/intrinsics/ServiceBridge:rpc(Ljava/lang/String;Ljava/util/Map;)Ljava/util/Map; : foundation.url.resolver.UrlResolutionException: RPC request 'supersedeBuildRun' failed: INTERNAL_ERROR - RPC error: INTERNAL_ERROR - Cannot supersede build run '4bff852d': it is already in terminal status FAILED. Only in-progress builds can be superseded. cause: null. The cancellation stays saved; retrying in 1920000ms.this service
5h 24m ago build remote stopCodexCoder21Organization/AiCliHostSupervisorDaemonEmbeddedRemote stop attempt 5 for check run 123410651364 failed: foundation.url.protocol.sandbox.SandboxException: Sandboxed code threw an exception: java.lang.InternalError: Exception encountered in implementation of foundation/url/sjvm/intrinsics/ServiceBridge:rpc(Ljava/lang/String;Ljava/util/Map;)Ljava/util/Map; : foundation.url.resolver.UrlResolutionException: RPC request 'supersedeBuildRun' failed: INTERNAL_ERROR - RPC error: INTERNAL_ERROR - Cannot supersede build run 'd40d269b': it is already in terminal status FAILED. Only in-progress builds can be superseded. cause: null. The cancellation stays saved; retrying in 960000ms.this service
6h 8m ago build remote stopCodexCoder21Organization/AiCliHostSupervisorDaemonEmbeddedRemote stop attempt 5 for check run 123291765685 failed: foundation.url.protocol.sandbox.SandboxException: Sandboxed code threw an exception: java.lang.InternalError: Exception encountered in implementation of foundation/url/sjvm/intrinsics/ServiceBridge:rpc(Ljava/lang/String;Ljava/util/Map;)Ljava/util/Map; : foundation.url.resolver.UrlResolutionException: RPC request 'supersedeBuildRun' failed: INTERNAL_ERROR - RPC error: INTERNAL_ERROR - Cannot supersede build run '8485074f': it is already in terminal status FAILED. Only in-progress builds can be superseded. cause: null. The cancellation stays saved; retrying in 960000ms.this service
6h 14m ago deliveryCodexCoder21Organization/AiCliHostSupervisorDaemonEmbeddedGitHub delivered check_run.completed for CodexCoder21Organization/AiCliHostSupervisorDaemonEmbedded.codexcoder21
6h 14m ago deliveryCodexCoder21Organization/AiCliHostSupervisorDaemonEmbeddedGitHub delivered check_suite.completed for CodexCoder21Organization/AiCliHostSupervisorDaemonEmbedded.codexcoder21
6h 14m ago completedCodexCoder21Organization/AiCliHostSupervisorDaemonEmbeddedAll tests passing (256/256)this service
6h 22m ago build remote stopCodexCoder21Organization/AiCliHostSupervisorDaemonEmbeddedRemote stop attempt 8 for check run 123138706939 failed: foundation.url.protocol.sandbox.SandboxException: Sandboxed code threw an exception: java.lang.InternalError: Exception encountered in implementation of foundation/url/sjvm/intrinsics/ServiceBridge:rpc(Ljava/lang/String;Ljava/util/Map;)Ljava/util/Map; : foundation.url.resolver.UrlResolutionException: RPC request 'supersedeBuildRun' failed: INTERNAL_ERROR - RPC error: INTERNAL_ERROR - Cannot supersede build run 'bed8f131': it is already in terminal status FAILED. Only in-progress builds can be superseded. cause: null. The cancellation stays saved; retrying in 1920000ms.this service
6h 25m ago build remote stopCodexCoder21Organization/AiCliHostSupervisorDaemonEmbeddedRemote stop attempt 4 for check run 123300877367 failed: foundation.url.protocol.sandbox.SandboxException: Sandboxed code threw an exception: java.lang.InternalError: Exception encountered in implementation of foundation/url/sjvm/intrinsics/ServiceBridge:rpc(Ljava/lang/String;Ljava/util/Map;)Ljava/util/Map; : foundation.url.resolver.UrlResolutionException: RPC request 'supersedeBuildRun' failed: INTERNAL_ERROR - RPC error: INTERNAL_ERROR - Cannot supersede build run 'c0c01ba1': it is already in terminal status FAILED. Only in-progress builds can be superseded. cause: null. The cancellation stays saved; retrying in 480000ms.this service
6h 30m ago build pendingCodexCoder21Organization/AiCliHostSupervisorDaemonEmbeddedRemote run deea7de8 remains PENDING after 2954s of queue wait; waiting for buildtest admission.this service
6h 35m ago build pendingCodexCoder21Organization/AiCliHostSupervisorDaemonEmbeddedRemote run deea7de8 remains PENDING after 2626s of queue wait; waiting for buildtest admission.this service
6h 39m ago build remote stopCodexCoder21Organization/AiCliHostSupervisorDaemonEmbeddedRemote stop attempt 7 for check run 123218537086 failed: foundation.url.protocol.sandbox.SandboxException: Sandboxed code threw an exception: java.lang.InternalError: Exception encountered in implementation of foundation/url/sjvm/intrinsics/ServiceBridge:rpc(Ljava/lang/String;Ljava/util/Map;)Ljava/util/Map; : foundation.url.resolver.UrlResolutionException: RPC request 'supersedeBuildRun' failed: INTERNAL_ERROR - RPC error: INTERNAL_ERROR - Cannot supersede build run '04e84303': it is already in terminal status FAILED. Only in-progress builds can be superseded. cause: null. The cancellation stays saved; retrying in 1920000ms.this service
6h 41m ago build pendingCodexCoder21Organization/AiCliHostSupervisorDaemonEmbeddedRemote run deea7de8 remains PENDING after 2274s of queue wait; waiting for buildtest admission.this service
6h 48m ago build pendingCodexCoder21Organization/AiCliHostSupervisorDaemonEmbeddedRemote run deea7de8 remains PENDING after 1854s of queue wait; waiting for buildtest admission.this service
6h 53m ago build remote stopCodexCoder21Organization/AiCliHostSupervisorDaemonEmbeddedRemote stop attempt 4 for check run 123410651364 failed: foundation.url.protocol.sandbox.SandboxException: Sandboxed code threw an exception: java.lang.InternalError: Exception encountered in implementation of foundation/url/sjvm/intrinsics/ServiceBridge:rpc(Ljava/lang/String;Ljava/util/Map;)Ljava/util/Map; : foundation.url.resolver.UrlResolutionException: RPC request 'supersedeBuildRun' failed: INTERNAL_ERROR - RPC error: INTERNAL_ERROR - Cannot supersede build run 'd40d269b': it is already in terminal status FAILED. Only in-progress builds can be superseded. cause: null. The cancellation stays saved; retrying in 480000ms.this service
6h 54m ago build pendingCodexCoder21Organization/AiCliHostSupervisorDaemonEmbeddedRemote run deea7de8 remains PENDING after 1476s of queue wait; waiting for buildtest admission.this service
7h 0m ago build pendingCodexCoder21Organization/AiCliHostSupervisorDaemonEmbeddedRemote run deea7de8 remains PENDING after 1156s of queue wait; waiting for buildtest admission.this service
7h 7m ago deliveryCodexCoder21Organization/AiCliHostSupervisorDaemonEmbeddedGitHub delivered check_run.completed for CodexCoder21Organization/AiCliHostSupervisorDaemonEmbedded.codexcoder21
7h 7m ago deliveryCodexCoder21Organization/AiCliHostSupervisorDaemonEmbeddedGitHub delivered check_suite.completed for CodexCoder21Organization/AiCliHostSupervisorDaemonEmbedded.codexcoder21
7h 7m ago completedCodexCoder21Organization/AiCliHostSupervisorDaemonEmbeddedBuild never started because the runner was saturated: every build worker was already running a check. It waited 1s in the deferred queue before the existing local deferred-submission deadline expired.this service
7h 7m ago deliveryCodexCoder21Organization/AiCliHostSupervisorDaemonEmbeddedGitHub delivered check_run.completed for CodexCoder21Organization/AiCliHostSupervisorDaemonEmbedded.codexcoder21
7h 7m ago completedCodexCoder21Organization/AiCliHostSupervisorDaemonEmbeddedBuild never started because the runner was saturated: every build worker was already running a check. It waited 144s in the deferred queue before the existing local deferred-submission deadline expired.this service
7h 8m ago deliveryCodexCoder21Organization/AiCliHostSupervisorDaemonEmbeddedGitHub delivered check_run.completed for CodexCoder21Organization/AiCliHostSupervisorDaemonEmbedded.codexcoder21
7h 9m ago completedCodexCoder21Organization/AiCliHostSupervisorDaemonEmbeddedBuild never started because the runner was saturated: every build worker was already running a check. It waited 76s in the deferred queue before the existing local deferred-submission deadline expired.this service
7h 10m ago build pendingCodexCoder21Organization/AiCliHostSupervisorDaemonEmbeddedRemote run deea7de8 remains PENDING after 553s of queue wait; waiting for buildtest admission.this service
7h 11m ago build remote stopCodexCoder21Organization/AiCliHostSupervisorDaemonEmbeddedRemote stop attempt 3 for check run 123300877367 failed: foundation.url.protocol.sandbox.SandboxException: Sandboxed code threw an exception: java.lang.InternalError: Exception encountered in implementation of foundation/url/sjvm/intrinsics/ServiceBridge:rpc(Ljava/lang/String;Ljava/util/Map;)Ljava/util/Map; : foundation.url.resolver.UrlResolutionException: RPC request 'supersedeBuildRun' failed: INTERNAL_ERROR - RPC error: INTERNAL_ERROR - Cannot supersede build run 'c0c01ba1': it is already in terminal status FAILED. Only in-progress builds can be superseded. cause: null. The cancellation stays saved; retrying in 240000ms.this service
7h 13m ago deliveryCodexCoder21Organization/AiCliHostSupervisorDaemonEmbeddedGitHub delivered check_run.completed for CodexCoder21Organization/AiCliHostSupervisorDaemonEmbedded.codexcoder21
7h 13m ago completedCodexCoder21Organization/AiCliHostSupervisorDaemonEmbeddedBuild never started because the runner was saturated: every build worker was already running a check. It waited 84s in the deferred queue before the existing local deferred-submission deadline expired.this service
7h 14m ago deliveryCodexCoder21Organization/AiCliHostSupervisorDaemonEmbeddedGitHub delivered check_run.completed for CodexCoder21Organization/AiCliHostSupervisorDaemonEmbedded.codexcoder21
7h 14m ago completedCodexCoder21Organization/AiCliHostSupervisorDaemonEmbeddedBuild never started because the runner was saturated: every build worker was already running a check. It waited 8s in the deferred queue before the existing local deferred-submission deadline expired.this service
7h 15m ago build remote stopCodexCoder21Organization/AiCliHostSupervisorDaemonEmbeddedRemote stop attempt 3 for check run 123302470327 failed: foundation.url.protocol.sandbox.SandboxException: Sandboxed code threw an exception: java.lang.InternalError: Exception encountered in implementation of foundation/url/sjvm/intrinsics/ServiceBridge:rpc(Ljava/lang/String;Ljava/util/Map;)Ljava/util/Map; : foundation.url.resolver.UrlResolutionException: RPC request 'supersedeBuildRun' failed: INTERNAL_ERROR - RPC error: INTERNAL_ERROR - Cannot supersede build run 'e7c314f8': it is already in terminal status FAILED. Only in-progress builds can be superseded. cause: null. The cancellation stays saved; retrying in 240000ms.this service
7h 15m ago build remote stopCodexCoder21Organization/AiCliHostSupervisorDaemonEmbeddedRemote stop attempt 8 for check run 123188549635 failed: foundation.url.protocol.sandbox.SandboxException: Sandboxed code threw an exception: java.lang.InternalError: Exception encountered in implementation of foundation/url/sjvm/intrinsics/ServiceBridge:rpc(Ljava/lang/String;Ljava/util/Map;)Ljava/util/Map; : foundation.url.resolver.UrlResolutionException: RPC request 'supersedeBuildRun' failed: INTERNAL_ERROR - RPC error: INTERNAL_ERROR - Cannot supersede build run '4bff852d': it is already in terminal status FAILED. Only in-progress builds can be superseded. cause: null. The cancellation stays saved; retrying in 1920000ms.this service
7h 15m ago build remote stopCodexCoder21Organization/AiCliHostSupervisorDaemonEmbeddedRemote stop attempt 4 for check run 123291765685 failed: foundation.url.protocol.sandbox.SandboxException: Sandboxed code threw an exception: java.lang.InternalError: Exception encountered in implementation of foundation/url/sjvm/intrinsics/ServiceBridge:rpc(Ljava/lang/String;Ljava/util/Map;)Ljava/util/Map; : foundation.url.resolver.UrlResolutionException: RPC request 'supersedeBuildRun' failed: INTERNAL_ERROR - RPC error: INTERNAL_ERROR - Cannot supersede build run '8485074f': it is already in terminal status FAILED. Only in-progress builds can be superseded. cause: null. The cancellation stays saved; retrying in 480000ms.this service
7h 15m ago deliveryCodexCoder21Organization/AiCliHostSupervisorDaemonEmbeddedGitHub delivered check_run.completed for CodexCoder21Organization/AiCliHostSupervisorDaemonEmbedded.codexcoder21
7h 15m ago completedCodexCoder21Organization/AiCliHostSupervisorDaemonEmbeddedBuild never started because the runner was saturated: every build worker was already running a check. It waited 61s in the deferred queue before the existing local deferred-submission deadline expired.this service
7h 16m ago build pendingCodexCoder21Organization/AiCliHostSupervisorDaemonEmbeddedRemote run deea7de8 remains PENDING after 187s of queue wait; waiting for buildtest admission.this service
7h 16m ago deliveryCodexCoder21Organization/AiCliHostSupervisorDaemonEmbeddedGitHub delivered check_run.completed for CodexCoder21Organization/AiCliHostSupervisorDaemonEmbedded.codexcoder21
7h 16m ago deliveryCodexCoder21Organization/AiCliHostSupervisorDaemonEmbeddedGitHub delivered check_run.completed for CodexCoder21Organization/AiCliHostSupervisorDaemonEmbedded.codexcoder21
7h 16m ago completedCodexCoder21Organization/AiCliHostSupervisorDaemonEmbeddedBuild never started because the runner was saturated: every build worker was already running a check. It waited 1s in the deferred queue before the existing local deferred-submission deadline expired.this service
7h 16m ago completedCodexCoder21Organization/AiCliHostSupervisorDaemonEmbeddedBuild never started because the runner was saturated: every build worker was already running a check. It waited 3s in the deferred queue before the existing local deferred-submission deadline expired.this service
7h 17m ago deliveryCodexCoder21Organization/AiCliHostSupervisorDaemonEmbeddedGitHub delivered check_suite.completed for CodexCoder21Organization/AiCliHostSupervisorDaemonEmbedded.codexcoder21
7h 17m ago deliveryCodexCoder21Organization/AiCliHostSupervisorDaemonEmbeddedGitHub delivered check_run.completed for CodexCoder21Organization/AiCliHostSupervisorDaemonEmbedded.codexcoder21
7h 17m ago completedCodexCoder21Organization/AiCliHostSupervisorDaemonEmbeddedBuild never started because the runner was saturated: every build worker was already running a check. It waited 9s in the deferred queue before the existing local deferred-submission deadline expired.this service
7h 18m ago deliveryCodexCoder21Organization/AiCliHostSupervisorDaemonEmbeddedGitHub delivered check_run.completed for CodexCoder21Organization/AiCliHostSupervisorDaemonEmbedded.codexcoder21
7h 19m ago deliveryCodexCoder21Organization/AiCliHostSupervisorDaemonEmbeddedGitHub delivered check_run.created for CodexCoder21Organization/AiCliHostSupervisorDaemonEmbedded.codexcoder21
7h 19m ago dispatchedCodexCoder21Organization/AiCliHostSupervisorDaemonEmbeddedSubmitted to the direct-buildtest build service.this service
7h 19m ago deliveryCodexCoder21Organization/AiCliHostSupervisorDaemonEmbeddedGitHub delivered check_run.created for CodexCoder21Organization/AiCliHostSupervisorDaemonEmbedded.codexcoder21
7h 19m ago deliveryCodexCoder21Organization/AiCliHostSupervisorDaemonEmbeddedGitHub delivered check_run.completed for CodexCoder21Organization/AiCliHostSupervisorDaemonEmbedded.codexcoder21
7h 21m ago completedCodexCoder21Organization/AiCliHostSupervisorDaemonEmbeddedBuild never started because the runner was saturated: every build worker was already running a check. It waited 13s in the deferred queue before the existing local deferred-submission deadline expired.this service
7h 26m ago deliveryCodexCoder21Organization/AiCliHostSupervisorDaemonEmbeddedGitHub delivered check_run.completed for CodexCoder21Organization/AiCliHostSupervisorDaemonEmbedded.codexcoder21
7h 26m ago completedCodexCoder21Organization/AiCliHostSupervisorDaemonEmbeddedBuild infrastructure error: foundation.url.protocol.sandbox.SandboxException: Cannot invoke method on closed instance proxy: buildtest/api/BuildRunImpl.getRunId()Ljava/lang/String;this service
7h 27m ago deliveryCodexCoder21Organization/AiCliHostSupervisorDaemonEmbeddedGitHub delivered check_run.completed for CodexCoder21Organization/AiCliHostSupervisorDaemonEmbedded.codexcoder21
7h 27m ago completedCodexCoder21Organization/AiCliHostSupervisorDaemonEmbeddedBuild never started because the runner was saturated: every build worker was already running a check. It waited 31s in the deferred queue before the existing local deferred-submission deadline expired.this service
7h 27m ago deliveryCodexCoder21Organization/AiCliHostSupervisorDaemonEmbeddedGitHub delivered check_run.completed for CodexCoder21Organization/AiCliHostSupervisorDaemonEmbedded.codexcoder21
7h 28m ago completedCodexCoder21Organization/AiCliHostSupervisorDaemonEmbeddedBuild never started because the runner was saturated: every build worker was already running a check. It waited 4s in the deferred queue before the existing local deferred-submission deadline expired.this service
7h 28m ago deliveryCodexCoder21Organization/AiCliHostSupervisorDaemonEmbeddedGitHub delivered check_run.completed for CodexCoder21Organization/AiCliHostSupervisorDaemonEmbedded.codexcoder21
7h 28m ago completedCodexCoder21Organization/AiCliHostSupervisorDaemonEmbeddedBuild never started because the runner was saturated: every build worker was already running a check. It waited 5s in the deferred queue before the existing local deferred-submission deadline expired.this service
7h 29m ago build remote stopCodexCoder21Organization/AiCliHostSupervisorDaemonEmbeddedRemote stop attempt 3 for check run 123410651364 failed: foundation.url.protocol.sandbox.SandboxException: Sandboxed code threw an exception: java.lang.InternalError: Exception encountered in implementation of foundation/url/sjvm/intrinsics/ServiceBridge:rpc(Ljava/lang/String;Ljava/util/Map;)Ljava/util/Map; : foundation.url.resolver.UrlResolutionException: RPC request 'supersedeBuildRun' failed: INTERNAL_ERROR - RPC error: INTERNAL_ERROR - Cannot supersede build run 'd40d269b': it is already in terminal status FAILED. Only in-progress builds can be superseded. cause: null. The cancellation stays saved; retrying in 240000ms.this service
7h 29m ago build remote stopCodexCoder21Organization/AiCliHostSupervisorDaemonEmbeddedRemote stop attempt 2 for check run 123410651364 failed: foundation.url.protocol.sandbox.SandboxException: Sandboxed code threw an exception: java.lang.InternalError: Exception encountered in implementation of foundation/url/sjvm/intrinsics/ServiceBridge:rpc(Ljava/lang/String;Ljava/util/Map;)Ljava/util/Map; : foundation.url.resolver.UrlResolutionException: RPC request 'supersedeBuildRun' failed: INTERNAL_ERROR - RPC error: INTERNAL_ERROR - Cannot supersede build run 'd40d269b': it is already in terminal status FAILED. Only in-progress builds can be superseded. cause: null. The cancellation stays saved; retrying in 120000ms.this service
7h 29m ago deliveryCodexCoder21Organization/AiCliHostSupervisorDaemonEmbeddedGitHub delivered check_run.completed for CodexCoder21Organization/AiCliHostSupervisorDaemonEmbedded.codexcoder21
7h 29m ago completedCodexCoder21Organization/AiCliHostSupervisorDaemonEmbeddedBuild never started because the runner was saturated: every build worker was already running a check. It waited 3s in the deferred queue before the existing local deferred-submission deadline expired.this service
7h 29m ago build remote stopCodexCoder21Organization/AiCliHostSupervisorDaemonEmbeddedRemote stop attempt 7 for check run 123138706939 failed: foundation.url.protocol.sandbox.SandboxException: Sandboxed code threw an exception: java.lang.InternalError: Exception encountered in implementation of foundation/url/sjvm/intrinsics/ServiceBridge:rpc(Ljava/lang/String;Ljava/util/Map;)Ljava/util/Map; : foundation.url.resolver.UrlResolutionException: RPC request 'supersedeBuildRun' failed: INTERNAL_ERROR - RPC error: INTERNAL_ERROR - Cannot supersede build run 'bed8f131': it is already in terminal status FAILED. Only in-progress builds can be superseded. cause: null. The cancellation stays saved; retrying in 1920000ms.this service
7h 32m ago deliveryCodexCoder21Organization/AiCliHostSupervisorDaemonEmbeddedGitHub delivered check_run.completed for CodexCoder21Organization/AiCliHostSupervisorDaemonEmbedded.codexcoder21
7h 32m ago deliveryCodexCoder21Organization/AiCliHostSupervisorDaemonEmbeddedGitHub delivered check_suite.completed for CodexCoder21Organization/AiCliHostSupervisorDaemonEmbedded.codexcoder21
7h 32m ago completedCodexCoder21Organization/AiCliHostSupervisorDaemonEmbeddedBuild never started because the runner was saturated: every build worker was already running a check. It waited 2s in the deferred queue before the existing local deferred-submission deadline expired.this service
7h 33m ago deliveryCodexCoder21Organization/AiCliHostSupervisorDaemonEmbeddedGitHub delivered check_run.completed for CodexCoder21Organization/AiCliHostSupervisorDaemonEmbedded.codexcoder21
7h 34m ago completedCodexCoder21Organization/AiCliHostSupervisorDaemonEmbeddedBuild never started because the runner was saturated: every build worker was already running a check. It waited 64s in the deferred queue before the existing local deferred-submission deadline expired.this service
7h 35m ago deliveryCodexCoder21Organization/AiCliHostSupervisorDaemonEmbeddedGitHub delivered check_run.completed for CodexCoder21Organization/AiCliHostSupervisorDaemonEmbedded.codexcoder21
7h 35m ago deliveryCodexCoder21Organization/AiCliHostSupervisorDaemonEmbeddedGitHub delivered check_run.completed for CodexCoder21Organization/AiCliHostSupervisorDaemonEmbedded.github-merge-queue[bot]
7h 35m ago deliveryCodexCoder21Organization/AiCliHostSupervisorDaemonEmbeddedGitHub delivered check_run.completed for CodexCoder21Organization/AiCliHostSupervisorDaemonEmbedded.github-merge-queue[bot]
7h 35m ago completedCodexCoder21Organization/AiCliHostSupervisorDaemonEmbeddedBuild never started because the runner was saturated: every build worker was already running a check. It waited 1s in the deferred queue before the existing local deferred-submission deadline expired.this service
7h 35m ago completedCodexCoder21Organization/AiCliHostSupervisorDaemonEmbeddedBuild never started because the runner was saturated: every build worker was already running a check. It waited 0s in the deferred queue before the existing local deferred-submission deadline expired.this service
7h 35m ago completedCodexCoder21Organization/AiCliHostSupervisorDaemonEmbeddedBuild never started because the runner was saturated: every build worker was already running a check. It waited 0s in the deferred queue before the existing local deferred-submission deadline expired.this service
7h 35m ago deliveryCodexCoder21Organization/AiCliHostSupervisorDaemonEmbeddedGitHub delivered check_run.completed for CodexCoder21Organization/AiCliHostSupervisorDaemonEmbedded.codexcoder21
7h 35m ago deliveryCodexCoder21Organization/AiCliHostSupervisorDaemonEmbeddedGitHub delivered check_suite.completed for CodexCoder21Organization/AiCliHostSupervisorDaemonEmbedded.codexcoder21
7h 35m ago completedCodexCoder21Organization/AiCliHostSupervisorDaemonEmbeddedBuild never started because the runner was saturated: every build worker was already running a check. It waited 35s in the deferred queue before the existing local deferred-submission deadline expired.this service
7h 36m ago deliveryCodexCoder21Organization/AiCliHostSupervisorDaemonEmbeddedGitHub delivered check_run.completed for CodexCoder21Organization/AiCliHostSupervisorDaemonEmbedded.codexcoder21
7h 36m ago completedCodexCoder21Organization/AiCliHostSupervisorDaemonEmbeddedBuild never started because the runner was saturated: every build worker was already running a check. It waited 32s in the deferred queue before the existing local deferred-submission deadline expired.this service
7h 40m ago deliveryCodexCoder21Organization/AiCliHostSupervisorDaemonEmbeddedGitHub delivered check_run.completed for CodexCoder21Organization/AiCliHostSupervisorDaemonEmbedded.codexcoder21
7h 40m ago completedCodexCoder21Organization/AiCliHostSupervisorDaemonEmbeddedBuild never started because the runner was saturated: every build worker was already running a check. It waited 4s in the deferred queue before the existing local deferred-submission deadline expired.this service
7h 41m ago deliveryCodexCoder21Organization/AiCliHostSupervisorDaemonEmbeddedGitHub delivered check_run.completed for CodexCoder21Organization/AiCliHostSupervisorDaemonEmbedded.codexcoder21
7h 41m ago deliveryCodexCoder21Organization/AiCliHostSupervisorDaemonEmbeddedGitHub delivered check_run.completed for CodexCoder21Organization/AiCliHostSupervisorDaemonEmbedded.codexcoder21
7h 41m ago completedCodexCoder21Organization/AiCliHostSupervisorDaemonEmbeddedBuild never started because the runner was saturated: every build worker was already running a check. It waited 4s in the deferred queue before the existing local deferred-submission deadline expired.this service
7h 41m ago completedCodexCoder21Organization/AiCliHostSupervisorDaemonEmbeddedBuild never started because the runner was saturated: every build worker was already running a check. It waited 4s in the deferred queue before the existing local deferred-submission deadline expired.this service
7h 41m ago deliveryCodexCoder21Organization/AiCliHostSupervisorDaemonEmbeddedGitHub delivered check_run.completed for CodexCoder21Organization/AiCliHostSupervisorDaemonEmbedded.codexcoder21
7h 41m ago completedCodexCoder21Organization/AiCliHostSupervisorDaemonEmbeddedBuild never started because the runner was saturated: every build worker was already running a check. It waited 0s in the deferred queue before the existing local deferred-submission deadline expired.this service
7h 42m ago deliveryCodexCoder21Organization/AiCliHostSupervisorDaemonEmbeddedGitHub delivered check_run.completed for CodexCoder21Organization/AiCliHostSupervisorDaemonEmbedded.codexcoder21
7h 42m ago completedCodexCoder21Organization/AiCliHostSupervisorDaemonEmbeddedBuild never started because the runner was saturated: every build worker was already running a check. It waited 0s in the deferred queue before the existing local deferred-submission deadline expired.this service
7h 42m ago deliveryCodexCoder21Organization/AiCliHostSupervisorDaemonEmbeddedGitHub delivered check_run.completed for CodexCoder21Organization/AiCliHostSupervisorDaemonEmbedded.codexcoder21
7h 42m ago deliveryCodexCoder21Organization/AiCliHostSupervisorDaemonEmbeddedGitHub delivered check_suite.completed for CodexCoder21Organization/AiCliHostSupervisorDaemonEmbedded.codexcoder21
7h 42m ago deliveryCodexCoder21Organization/AiCliHostSupervisorDaemonEmbeddedGitHub delivered check_suite.completed for CodexCoder21Organization/AiCliHostSupervisorDaemonEmbedded.codexcoder21
7h 42m ago deliveryCodexCoder21Organization/AiCliHostSupervisorDaemonEmbeddedGitHub delivered check_run.completed for CodexCoder21Organization/AiCliHostSupervisorDaemonEmbedded.codexcoder21
7h 42m ago deliveryCodexCoder21Organization/AiCliHostSupervisorDaemonEmbeddedGitHub delivered check_run.completed for CodexCoder21Organization/AiCliHostSupervisorDaemonEmbedded.codexcoder21
7h 42m ago completedCodexCoder21Organization/AiCliHostSupervisorDaemonEmbeddedBuild never started because the runner was saturated: every build worker was already running a check. It waited 0s in the deferred queue before the existing local deferred-submission deadline expired.this service
7h 42m ago deliveryCodexCoder21Organization/AiCliHostSupervisorDaemonEmbeddedGitHub delivered check_suite.completed for CodexCoder21Organization/AiCliHostSupervisorDaemonEmbedded.codexcoder21
7h 42m ago deliveryCodexCoder21Organization/AiCliHostSupervisorDaemonEmbeddedGitHub delivered check_run.completed for CodexCoder21Organization/AiCliHostSupervisorDaemonEmbedded.codexcoder21
7h 42m ago completedCodexCoder21Organization/AiCliHostSupervisorDaemonEmbeddedBuild never started because the runner was saturated: every build worker was already running a check. It waited 0s in the deferred queue before the existing local deferred-submission deadline expired.this service
7h 43m ago completedCodexCoder21Organization/AiCliHostSupervisorDaemonEmbeddedBuild never started because the runner was saturated: every build worker was already running a check. It waited 0s in the deferred queue before the existing local deferred-submission deadline expired.this service
7h 43m ago deliveryCodexCoder21Organization/AiCliHostSupervisorDaemonEmbeddedGitHub delivered check_suite.completed for CodexCoder21Organization/AiCliHostSupervisorDaemonEmbedded.codexcoder21
7h 43m ago completedCodexCoder21Organization/AiCliHostSupervisorDaemonEmbeddedBuild never started because the runner was saturated: every build worker was already running a check. It waited 1s in the deferred queue before the existing local deferred-submission deadline expired.this service
7h 43m ago deliveryCodexCoder21Organization/AiCliHostSupervisorDaemonEmbeddedGitHub delivered check_run.completed for CodexCoder21Organization/AiCliHostSupervisorDaemonEmbedded.codexcoder21
7h 43m ago completedCodexCoder21Organization/AiCliHostSupervisorDaemonEmbeddedBuild never started because the runner was saturated: every build worker was already running a check. It waited 14s in the deferred queue before the existing local deferred-submission deadline expired.this service
7h 43m ago deliveryCodexCoder21Organization/AiCliHostSupervisorDaemonEmbeddedGitHub delivered check_run.completed for CodexCoder21Organization/AiCliHostSupervisorDaemonEmbedded.codexcoder21
7h 43m ago deliveryCodexCoder21Organization/AiCliHostSupervisorDaemonEmbeddedGitHub delivered check_suite.completed for CodexCoder21Organization/AiCliHostSupervisorDaemonEmbedded.codexcoder21
7h 43m ago deliveryCodexCoder21Organization/AiCliHostSupervisorDaemonEmbeddedGitHub delivered check_run.completed for CodexCoder21Organization/AiCliHostSupervisorDaemonEmbedded.codexcoder21
7h 43m ago deliveryCodexCoder21Organization/AiCliHostSupervisorDaemonEmbeddedGitHub delivered check_suite.completed for CodexCoder21Organization/AiCliHostSupervisorDaemonEmbedded.codexcoder21
7h 43m ago completedCodexCoder21Organization/AiCliHostSupervisorDaemonEmbeddedBuild never started because the runner was saturated: every build worker was already running a check. It waited 0s in the deferred queue before the existing local deferred-submission deadline expired.this service
7h 43m ago completedCodexCoder21Organization/AiCliHostSupervisorDaemonEmbeddedBuild never started because the runner was saturated: every build worker was already running a check. It waited 0s in the deferred queue before the existing local deferred-submission deadline expired.this service
7h 43m ago deliveryCodexCoder21Organization/AiCliHostSupervisorDaemonEmbeddedGitHub delivered check_run.completed for CodexCoder21Organization/AiCliHostSupervisorDaemonEmbedded.codexcoder21
7h 43m ago completedCodexCoder21Organization/AiCliHostSupervisorDaemonEmbeddedBuild never started because the runner was saturated: every build worker was already running a check. It waited 3s in the deferred queue before the existing local deferred-submission deadline expired.this service
7h 43m ago deliveryCodexCoder21Organization/AiCliHostSupervisorDaemonEmbeddedGitHub delivered check_suite.completed for CodexCoder21Organization/AiCliHostSupervisorDaemonEmbedded.codexcoder21
7h 43m ago deliveryCodexCoder21Organization/AiCliHostSupervisorDaemonEmbeddedGitHub delivered check_run.completed for CodexCoder21Organization/AiCliHostSupervisorDaemonEmbedded.codexcoder21
7h 43m ago deliveryCodexCoder21Organization/AiCliHostSupervisorDaemonEmbeddedGitHub delivered check_run.completed for CodexCoder21Organization/AiCliHostSupervisorDaemonEmbedded.codexcoder21
7h 43m ago completedCodexCoder21Organization/AiCliHostSupervisorDaemonEmbeddedBuild never started because the runner was saturated: every build worker was already running a check. It waited 25s in the deferred queue before the existing local deferred-submission deadline expired.this service
7h 43m ago completedCodexCoder21Organization/AiCliHostSupervisorDaemonEmbeddedBuild never started because the runner was saturated: every build worker was already running a check. It waited 2s in the deferred queue before the existing local deferred-submission deadline expired.this service
7h 43m ago deliveryCodexCoder21Organization/AiCliHostSupervisorDaemonEmbeddedGitHub delivered check_run.completed for CodexCoder21Organization/AiCliHostSupervisorDaemonEmbedded.codexcoder21
7h 43m ago completedCodexCoder21Organization/AiCliHostSupervisorDaemonEmbeddedBuild never started because the runner was saturated: every build worker was already running a check. It waited 2s in the deferred queue before the existing local deferred-submission deadline expired.this service
7h 44m ago deliveryCodexCoder21Organization/AiCliHostSupervisorDaemonEmbeddedGitHub delivered check_run.completed for CodexCoder21Organization/AiCliHostSupervisorDaemonEmbedded.codexcoder21
7h 44m ago completedCodexCoder21Organization/AiCliHostSupervisorDaemonEmbeddedBuild never started because the runner was saturated: every build worker was already running a check. It waited 5s in the deferred queue before the existing local deferred-submission deadline expired.this service
7h 44m ago deliveryCodexCoder21Organization/AiCliHostSupervisorDaemonEmbeddedGitHub delivered check_run.completed for CodexCoder21Organization/AiCliHostSupervisorDaemonEmbedded.codexcoder21
7h 44m ago completedCodexCoder21Organization/AiCliHostSupervisorDaemonEmbeddedBuild never started because the runner was saturated: every build worker was already running a check. It waited 1s in the deferred queue before the existing local deferred-submission deadline expired.this service
7h 44m ago deliveryCodexCoder21Organization/AiCliHostSupervisorDaemonEmbeddedGitHub delivered check_run.completed for CodexCoder21Organization/AiCliHostSupervisorDaemonEmbedded.codexcoder21
7h 44m ago deliveryCodexCoder21Organization/AiCliHostSupervisorDaemonEmbeddedGitHub delivered check_run.completed for CodexCoder21Organization/AiCliHostSupervisorDaemonEmbedded.codexcoder21
7h 44m ago completedCodexCoder21Organization/AiCliHostSupervisorDaemonEmbeddedBuild never started because the runner was saturated: every build worker was already running a check. It waited 17s in the deferred queue before the existing local deferred-submission deadline expired.this service
7h 44m ago deliveryCodexCoder21Organization/AiCliHostSupervisorDaemonEmbeddedGitHub delivered check_run.completed for CodexCoder21Organization/AiCliHostSupervisorDaemonEmbedded.codexcoder21
7h 44m ago completedCodexCoder21Organization/AiCliHostSupervisorDaemonEmbeddedBuild never started because the runner was saturated: every build worker was already running a check. It waited 2s in the deferred queue before the existing local deferred-submission deadline expired.this service
7h 44m ago deliveryCodexCoder21Organization/AiCliHostSupervisorDaemonEmbeddedGitHub delivered check_run.completed for CodexCoder21Organization/AiCliHostSupervisorDaemonEmbedded.codexcoder21
7h 44m ago completedCodexCoder21Organization/AiCliHostSupervisorDaemonEmbeddedBuild never started because the runner was saturated: every build worker was already running a check. It waited 3s in the deferred queue before the existing local deferred-submission deadline expired.this service
7h 44m ago completedCodexCoder21Organization/AiCliHostSupervisorDaemonEmbeddedBuild never started because the runner was saturated: every build worker was already running a check. It waited 1s in the deferred queue before the existing local deferred-submission deadline expired.this service
7h 45m ago deliveryCodexCoder21Organization/AiCliHostSupervisorDaemonEmbeddedGitHub delivered check_run.completed for CodexCoder21Organization/AiCliHostSupervisorDaemonEmbedded.codexcoder21
7h 45m ago deliveryCodexCoder21Organization/AiCliHostSupervisorDaemonEmbeddedGitHub delivered check_suite.completed for CodexCoder21Organization/AiCliHostSupervisorDaemonEmbedded.codexcoder21
7h 45m ago completedCodexCoder21Organization/AiCliHostSupervisorDaemonEmbeddedBuild never started because the runner was saturated: every build worker was already running a check. It waited 0s in the deferred queue before the existing local deferred-submission deadline expired.this service
7h 45m ago deliveryCodexCoder21Organization/AiCliHostSupervisorDaemonEmbeddedGitHub delivered check_run.completed for CodexCoder21Organization/AiCliHostSupervisorDaemonEmbedded.codexcoder21
7h 45m ago completedCodexCoder21Organization/AiCliHostSupervisorDaemonEmbeddedBuild never started because the runner was saturated: every build worker was already running a check. It waited 27s in the deferred queue before the existing local deferred-submission deadline expired.this service
7h 46m ago deliveryCodexCoder21Organization/AiCliHostSupervisorDaemonEmbeddedGitHub delivered check_run.completed for CodexCoder21Organization/AiCliHostSupervisorDaemonEmbedded.codexcoder21
7h 46m ago completedCodexCoder21Organization/AiCliHostSupervisorDaemonEmbeddedBuild never started because the runner was saturated: every build worker was already running a check. It waited 0s in the deferred queue before the existing local deferred-submission deadline expired.this service
7h 46m ago build remote stopCodexCoder21Organization/AiCliHostSupervisorDaemonEmbeddedRemote stop attempt 2 for check run 123302470327 failed: foundation.url.protocol.sandbox.SandboxException: Sandboxed code threw an exception: java.lang.InternalError: Exception encountered in implementation of foundation/url/sjvm/intrinsics/ServiceBridge:rpc(Ljava/lang/String;Ljava/util/Map;)Ljava/util/Map; : foundation.url.resolver.UrlResolutionException: RPC request 'supersedeBuildRun' failed: INTERNAL_ERROR - RPC error: INTERNAL_ERROR - Cannot supersede build run 'e7c314f8': it is already in terminal status FAILED. Only in-progress builds can be superseded. cause: null. The cancellation stays saved; retrying in 120000ms.this service
7h 46m ago deliveryCodexCoder21Organization/AiCliHostSupervisorDaemonEmbeddedGitHub delivered check_run.completed for CodexCoder21Organization/AiCliHostSupervisorDaemonEmbedded.codexcoder21
7h 46m ago completedCodexCoder21Organization/AiCliHostSupervisorDaemonEmbeddedBuild never started because the runner was saturated: every build worker was already running a check. It waited 0s in the deferred queue before the existing local deferred-submission deadline expired.this service
7h 46m ago build remote stopCodexCoder21Organization/AiCliHostSupervisorDaemonEmbeddedRemote stop attempt 2 for check run 123300877367 failed: foundation.url.protocol.sandbox.SandboxException: Sandboxed code threw an exception: java.lang.InternalError: Exception encountered in implementation of foundation/url/sjvm/intrinsics/ServiceBridge:rpc(Ljava/lang/String;Ljava/util/Map;)Ljava/util/Map; : foundation.url.resolver.UrlResolutionException: RPC request 'supersedeBuildRun' failed: INTERNAL_ERROR - RPC error: INTERNAL_ERROR - Cannot supersede build run 'c0c01ba1': it is already in terminal status FAILED. Only in-progress builds can be superseded. cause: null. The cancellation stays saved; retrying in 120000ms.this service
7h 46m ago deliveryCodexCoder21Organization/AiCliHostSupervisorDaemonEmbeddedGitHub delivered check_run.completed for CodexCoder21Organization/AiCliHostSupervisorDaemonEmbedded.codexcoder21
7h 46m ago completedCodexCoder21Organization/AiCliHostSupervisorDaemonEmbeddedBuild never started because the runner was saturated: every build worker was already running a check. It waited 0s in the deferred queue before the existing local deferred-submission deadline expired.this service
7h 47m ago deliveryCodexCoder21Organization/AiCliHostSupervisorDaemonEmbeddedGitHub delivered check_run.completed for CodexCoder21Organization/AiCliHostSupervisorDaemonEmbedded.codexcoder21
7h 47m ago deliveryCodexCoder21Organization/AiCliHostSupervisorDaemonEmbeddedGitHub delivered check_run.completed for CodexCoder21Organization/AiCliHostSupervisorDaemonEmbedded.codexcoder21
7h 47m ago completedCodexCoder21Organization/AiCliHostSupervisorDaemonEmbeddedBuild never started because the runner was saturated: every build worker was already running a check. It waited 0s in the deferred queue before the existing local deferred-submission deadline expired.this service
7h 47m ago completedCodexCoder21Organization/AiCliHostSupervisorDaemonEmbeddedBuild never started because the runner was saturated: every build worker was already running a check. It waited 0s in the deferred queue before the existing local deferred-submission deadline expired.this service
7h 47m ago build remote stopCodexCoder21Organization/AiCliHostSupervisorDaemonEmbeddedRemote stop attempt 3 for check run 123291765685 failed: foundation.url.protocol.sandbox.SandboxException: Sandboxed code threw an exception: java.lang.InternalError: Exception encountered in implementation of foundation/url/sjvm/intrinsics/ServiceBridge:rpc(Ljava/lang/String;Ljava/util/Map;)Ljava/util/Map; : foundation.url.resolver.UrlResolutionException: RPC request 'supersedeBuildRun' failed: INTERNAL_ERROR - RPC error: INTERNAL_ERROR - Cannot supersede build run '8485074f': it is already in terminal status FAILED. Only in-progress builds can be superseded. cause: null. The cancellation stays saved; retrying in 240000ms.this service
7h 48m ago deliveryCodexCoder21Organization/AiCliHostSupervisorDaemonEmbeddedGitHub delivered check_suite.completed for CodexCoder21Organization/AiCliHostSupervisorDaemonEmbedded.codexcoder21
7h 48m ago deliveryCodexCoder21Organization/AiCliHostSupervisorDaemonEmbeddedGitHub delivered check_run.completed for CodexCoder21Organization/AiCliHostSupervisorDaemonEmbedded.codexcoder21
7h 48m ago completedCodexCoder21Organization/AiCliHostSupervisorDaemonEmbeddedBuild never started because the runner was saturated: every build worker was already running a check. It waited 0s in the deferred queue before the existing local deferred-submission deadline expired.this service
7h 48m ago deliveryCodexCoder21Organization/AiCliHostSupervisorDaemonEmbeddedGitHub delivered check_run.completed for CodexCoder21Organization/AiCliHostSupervisorDaemonEmbedded.codexcoder21
7h 48m ago deliveryCodexCoder21Organization/AiCliHostSupervisorDaemonEmbeddedGitHub delivered check_suite.completed for CodexCoder21Organization/AiCliHostSupervisorDaemonEmbedded.codexcoder21
7h 48m ago deliveryCodexCoder21Organization/AiCliHostSupervisorDaemonEmbeddedGitHub delivered check_run.completed for CodexCoder21Organization/AiCliHostSupervisorDaemonEmbedded.codexcoder21