kotlin.build CI

Trigger log

Every delivery GitHub sent and what this service did with it — including the ones that produced no build. Newest first.

WhenWhatRepositoryDetailWho
37s ago build pendingCodexCoder21Organization/BuildTestProjectionJournalRemote run 73fcd3ec remains PENDING after 5s of queue wait; waiting for buildtest admission.this service
31s ago skippedCodexCoder21Organization/BuildTestProjectionJournalThe non-PR branch 'wip/fix96-97-p2-evidence' uses the wip/ checkpoint prefix, so this check_suite request started no build.this service
31s ago deliveryCodexCoder21Organization/BuildTestProjectionJournalGitHub delivered check_suite.requested for CodexCoder21Organization/BuildTestProjectionJournal.codexcoder21
32s ago deliveryCodexCoder21Organization/BuildTestProjectionJournalGitHub delivered push for CodexCoder21Organization/BuildTestProjectionJournal.codexcoder21
40s ago deliveryCodexCoder21Organization/BuildTestProjectionJournalGitHub delivered check_run.created for CodexCoder21Organization/BuildTestProjectionJournal.codexcoder21
41s ago deliveryCodexCoder21Organization/BuildTestProjectionJournalGitHub delivered check_run.created for CodexCoder21Organization/BuildTestProjectionJournal.codexcoder21
42s ago build remote stopCodexCoder21Organization/UrlResolverRemote stop attempt 12 for check run 123302499978 failed: foundation.url.protocol.sandbox.SandboxException: Sandboxed code threw an exception: java.lang.InternalError: Exception encountered in implementation of foundation/url/sjvm/intrinsics/ServiceBridge:rpc(Ljava/lang/String;Ljava/util/Map;)Ljava/util/Map; : foundation.url.resolver.UrlResolutionException: RPC request 'supersedeBuildRun' failed: RELAY_ERROR - Handler error: RPC error: INTERNAL_ERROR - Cannot supersede build run '1228b641': it is already in terminal status FAILED. Only in-progress builds can be superseded. cause: null. The cancellation stays saved; retrying in 1920000ms.this service
42s ago build remote stopCodexCoder21Organization/BuildTestProjectionJournalRemote stop attempt 10 for check run 124131574870 failed: foundation.url.protocol.sandbox.SandboxException: Sandboxed code threw an exception: java.lang.InternalError: Exception encountered in implementation of foundation/url/sjvm/intrinsics/ServiceBridge:rpc(Ljava/lang/String;Ljava/util/Map;)Ljava/util/Map; : foundation.url.resolver.UrlResolutionException: RPC request 'supersedeBuildRun' failed: RELAY_ERROR - Handler error: RPC error: INTERNAL_ERROR - Cannot supersede build run '01ead0a1': it is already in terminal status FAILED. Only in-progress builds can be superseded. cause: null. The cancellation stays saved; retrying in 1920000ms.this service
42s ago build remote stopCodexCoder21Organization/BuildTestProjectionJournalRemote stop attempt 10 for check run 124282946036 failed: foundation.url.protocol.sandbox.SandboxException: Sandboxed code threw an exception: java.lang.InternalError: Exception encountered in implementation of foundation/url/sjvm/intrinsics/ServiceBridge:rpc(Ljava/lang/String;Ljava/util/Map;)Ljava/util/Map; : foundation.url.resolver.UrlResolutionException: RPC request 'supersedeBuildRun' failed: RELAY_ERROR - Handler error: RPC error: INTERNAL_ERROR - Cannot supersede build run '58b8c6b0': it is already in terminal status CANCELED. Only in-progress builds can be superseded. cause: null. The cancellation stays saved; retrying in 1920000ms.this service
43s ago dispatchedCodexCoder21Organization/BuildTestProjectionJournalSubmitted to the direct-buildtest build service.this service
43s ago build recovery failedCodexCoder21Organization/kompile-buildscriptFailed to recover shadow check 118992660637: foundation.url.protocol.sandbox.SandboxException: Sandboxed code threw an exception: java.lang.InternalError: Exception encountered in implementation of foundation/url/sjvm/intrinsics/ServiceBridge:rpc(Ljava/lang/String;Ljava/util/Map;)Ljava/util/Map; : foundation.url.resolver.UrlResolutionException: RPC request 'finalizeUpload' failed: INTERNAL_ERROR - RPC error: -1 - IllegalStateException: Cannot run CI operation 'finalizeUpload' because the url://buildtest/ connection has not been established, and it did not come up within 20000ms of waiting. Retry once the server logs 'url://buildtest/ connection established; ingestion and CI orchestration enabled.' cause: null at foundation.url.resolver.sandbox.TypeMarshaling.fromJvmResult$foundation_url_resolver_sandbox(TypeMarshaling.kt:692) at foundation.url.resolver.sandbox.InstanceMethodDispatcher$invokeWithActivity$3.invoke(SandboxedProxyGenerator.kt:2106) at foundation.url.resolver.sandbox.InstanceMethodDispatcher$invokeWithActivity$3.invoke(SandboxedProxyGenerator.kt:2037) at foundation.url.resolver.sandbox.SandboxedProxyGeneratorKt$invokeSandboxMethod$future$1$result$1.invoke(SandboxedProxyGenerator.kt:1491) at community.kotlin.clocks.hierarchical.RequiredClockPadKt.withRequiredClockPad(RequiredClockPad.kt:89) at foundation.url.resolver.sandbox.SandboxedProxyGeneratorKt.invokeSandboxMethod$lambda$4(SandboxedProxyGenerator.kt:1491) at java.base/java.util.concurrent.FutureTask.run(FutureTask.java:317) at foundation.url.resolver.sandbox.SandboxInvocationLane.runScheduled(SandboxedProxyGenerator.kt:1379) at foundation.url.resolver.sandbox.SandboxInvocationLane.schedule$lambda$5(SandboxedProxyGenerator.kt:1370) at java.base/java.util.concurrent.ThreadPoolExecutor.runWorker(ThreadPoolExecutor.java:1144) at java.base/java.util.concurrent.ThreadPoolExecutor$Worker.run(ThreadPoolExecutor.java:642) at java.base/java.lang.Thread.run(Thread.java:1583) Caused by: java.lang.RuntimeException: java.lang.InternalError: Exception encountered in implementation of foundation/url/sjvm/intrinsics/ServiceBridge:rpc(Ljava/lang/String;Ljava/util/Map;)Ljava/util/Map; : foundation.url.resolver.UrlResolutionException: RPC request 'finalizeUpload' failed: INTERNAL_ERROR - RPC error: -1 - IllegalStateException: Cannot run CI operation 'finalizeUpload' because the url://buildtest/ connection has not been established, and it did not come up within 20000ms of waiting. Retry once the server logs 'url://buildtest/ connection established; ingestion and CI orchestration enabled.' at foundation.url.resolver.sandbox.TypeMarshaling.fromJvmResult$foundation_url_resolver_sandbox(TypeMarshaling.kt:695) ... 11 more this service
45s ago deliveryCodexCoder21Organization/BuildTestProjectionJournalGitHub delivered check_run.created for CodexCoder21Organization/BuildTestProjectionJournal.codexcoder21
45s ago deliveryCodexCoder21Organization/BuildTestProjectionJournalGitHub delivered pull_request.synchronize for CodexCoder21Organization/BuildTestProjectionJournal.codexcoder21
47s ago deliveryCodexCoder21Organization/BuildTestProjectionJournalGitHub delivered check_suite.requested for CodexCoder21Organization/BuildTestProjectionJournal.codexcoder21
48s ago deliveryCodexCoder21Organization/BuildTestProjectionJournalGitHub delivered push for CodexCoder21Organization/BuildTestProjectionJournal.codexcoder21
1m 22s ago build remote stopCodexCoder21Organization/TinySiteWuiRemote stop attempt 11 for check run 123189304018 failed: foundation.url.protocol.sandbox.SandboxException: Sandboxed code threw an exception: java.lang.InternalError: Exception encountered in implementation of foundation/url/sjvm/intrinsics/ServiceBridge:rpc(Ljava/lang/String;Ljava/util/Map;)Ljava/util/Map; : foundation.url.resolver.UrlResolutionException: RPC request 'supersedeBuildRun' failed: RELAY_ERROR - Handler error: RPC error: INTERNAL_ERROR - Cannot supersede build run 'db6bbf24': it is already in terminal status FAILED. Only in-progress builds can be superseded. cause: null. The cancellation stays saved; retrying in 1920000ms.this service
1m 22s ago build remote stopCodexCoder21Organization/HandoffWuiRemote stop attempt 10 for check run 123333828280 failed: foundation.url.protocol.sandbox.SandboxException: Sandboxed code threw an exception: java.lang.InternalError: Exception encountered in implementation of foundation/url/sjvm/intrinsics/ServiceBridge:rpc(Ljava/lang/String;Ljava/util/Map;)Ljava/util/Map; : foundation.url.resolver.UrlResolutionException: RPC request 'supersedeBuildRun' failed: RELAY_ERROR - Handler error: RPC error: INTERNAL_ERROR - Cannot supersede build run '7ecc07fe': it is already in terminal status FAILED. Only in-progress builds can be superseded. cause: null. The cancellation stays saved; retrying in 1920000ms.this service
2m 46s ago deliveryCodexCoder21Organization/BuildTestProjectionJournalGitHub delivered check_run.completed for CodexCoder21Organization/BuildTestProjectionJournal.codexcoder21
2m 53s ago build remote stopCodexCoder21Organization/UrlResolverRemote stop attempt 12 for check run 123219321778 failed: foundation.url.protocol.sandbox.SandboxException: Sandboxed code threw an exception: java.lang.InternalError: Exception encountered in implementation of foundation/url/sjvm/intrinsics/ServiceBridge:rpc(Ljava/lang/String;Ljava/util/Map;)Ljava/util/Map; : foundation.url.resolver.UrlResolutionException: RPC request 'supersedeBuildRun' failed: RELAY_ERROR - Handler error: RPC error: INTERNAL_ERROR - Cannot supersede build run '73a4c8fc': it is already in terminal status FAILED. Only in-progress builds can be superseded. cause: null. The cancellation stays saved; retrying in 1920000ms.this service
2m 53s ago build remote stopCodexCoder21Organization/HandoffWuiRemote stop attempt 17 for check run 123240094704 failed: foundation.url.protocol.sandbox.SandboxException: Sandboxed code threw an exception: java.lang.InternalError: Exception encountered in implementation of foundation/url/sjvm/intrinsics/ServiceBridge:rpc(Ljava/lang/String;Ljava/util/Map;)Ljava/util/Map; : foundation.url.resolver.UrlResolutionException: RPC request 'supersedeBuildRun' failed: RELAY_ERROR - Handler error: RPC error: INTERNAL_ERROR - Cannot supersede build run '5b64c329': it is already in terminal status FAILED. Only in-progress builds can be superseded. cause: null. The cancellation stays saved; retrying in 1920000ms.this service
2m 53s ago build remote stopCodexCoder21Organization/BuildTestProjectionJournalRemote stop attempt 177 for check run 120374520850 failed: foundation.url.protocol.sandbox.SandboxException: Sandboxed code threw an exception: java.lang.InternalError: Exception encountered in implementation of foundation/url/sjvm/intrinsics/ServiceBridge:rpc(Ljava/lang/String;Ljava/util/Map;)Ljava/util/Map; : foundation.url.resolver.UrlResolutionException: RPC request 'supersedeBuildRun' failed: RELAY_ERROR - Handler error: RPC error: INTERNAL_ERROR - Cannot supersede build run '31e5555b': it is already in terminal status FAILED. Only in-progress builds can be superseded. cause: null. The cancellation stays saved; retrying in 1920000ms.this service
3m 18s ago build pendingCodexCoder21Organization/BuildTestProjectionJournalRemote run dd857635 remains PENDING after 3s of queue wait; waiting for buildtest admission.this service
3m 20s ago deliveryCodexCoder21Organization/BuildTestProjectionJournalGitHub delivered check_run.created for CodexCoder21Organization/BuildTestProjectionJournal.codexcoder21
3m 20s ago deliveryCodexCoder21Organization/BuildTestProjectionJournalGitHub delivered check_run.created for CodexCoder21Organization/BuildTestProjectionJournal.codexcoder21
3m 22s ago dispatchedCodexCoder21Organization/BuildTestProjectionJournalSubmitted to the direct-buildtest build service.this service
3m 23s ago deliveryCodexCoder21Organization/BuildTestProjectionJournalGitHub delivered pull_request.edited for CodexCoder21Organization/BuildTestProjectionJournal.codexcoder21
3m 23s ago deliveryCodexCoder21Organization/BuildTestProjectionJournalGitHub delivered check_run.created for CodexCoder21Organization/BuildTestProjectionJournal.codexcoder21
3m 24s ago build remote stopCodexCoder21Organization/BuildTestProjectionJournalRemote stop attempt 13 for check run 123846602397 failed: foundation.url.protocol.sandbox.SandboxException: Sandboxed code threw an exception: java.lang.InternalError: Exception encountered in implementation of foundation/url/sjvm/intrinsics/ServiceBridge:rpc(Ljava/lang/String;Ljava/util/Map;)Ljava/util/Map; : foundation.url.resolver.UrlResolutionException: RPC request 'supersedeBuildRun' failed: RELAY_ERROR - Handler error: RPC error: INTERNAL_ERROR - Cannot supersede build run '5ad84146': it is already in terminal status COMPLETED. Only in-progress builds can be superseded. cause: null. The cancellation stays saved; retrying in 1920000ms.this service
3m 24s ago build remote stopCodexCoder21Organization/BuildTestProjectionJournalRemote stop attempt 12 for check run 123918946157 failed: foundation.url.protocol.sandbox.SandboxException: Sandboxed code threw an exception: java.lang.InternalError: Exception encountered in implementation of foundation/url/sjvm/intrinsics/ServiceBridge:rpc(Ljava/lang/String;Ljava/util/Map;)Ljava/util/Map; : foundation.url.resolver.UrlResolutionException: RPC request 'supersedeBuildRun' failed: RELAY_ERROR - Handler error: RPC error: INTERNAL_ERROR - Cannot supersede build run '4512210c': it is already in terminal status FAILED. Only in-progress builds can be superseded. cause: null. The cancellation stays saved; retrying in 1920000ms.this service
3m 24s ago deliveryCodexCoder21Organization/BuildTestProjectionJournalGitHub delivered pull_request.synchronize for CodexCoder21Organization/BuildTestProjectionJournal.codexcoder21
3m 25s ago deliveryCodexCoder21Organization/BuildTestProjectionJournalGitHub delivered check_suite.requested for CodexCoder21Organization/BuildTestProjectionJournal.codexcoder21
3m 25s ago deliveryCodexCoder21Organization/BuildTestProjectionJournalGitHub delivered push for CodexCoder21Organization/BuildTestProjectionJournal.codexcoder21
3m 45s ago skippedCodexCoder21Organization/BuildTestEmbeddedThe non-PR branch 'wip/fix1738-p2-ckpt' uses the wip/ checkpoint prefix, so this check_suite request started no build.this service
3m 45s ago deliveryCodexCoder21Organization/BuildTestEmbeddedGitHub delivered check_suite.requested for CodexCoder21Organization/BuildTestEmbedded.codexcoder21
3m 46s ago deliveryCodexCoder21Organization/BuildTestEmbeddedGitHub delivered push for CodexCoder21Organization/BuildTestEmbedded.codexcoder21
4m 14s ago build remote stopCodexCoder21Organization/PerformanceTestServerServiceRemote stop attempt 10 for check run 123353019185 failed: foundation.url.protocol.sandbox.SandboxException: Sandboxed code threw an exception: java.lang.InternalError: Exception encountered in implementation of foundation/url/sjvm/intrinsics/ServiceBridge:rpc(Ljava/lang/String;Ljava/util/Map;)Ljava/util/Map; : foundation.url.resolver.UrlResolutionException: RPC request 'supersedeBuildRun' failed: RELAY_ERROR - Handler error: RPC error: INTERNAL_ERROR - Cannot supersede build run 'a4395125': it is already in terminal status FAILED. Only in-progress builds can be superseded. cause: null. The cancellation stays saved; retrying in 1920000ms.this service
5m 13s ago build remote stopCodexCoder21Organization/UrlResolverRemote stop attempt 12 for check run 123188541884 failed: foundation.url.protocol.sandbox.SandboxException: Sandboxed code threw an exception: java.lang.InternalError: Exception encountered in implementation of foundation/url/sjvm/intrinsics/ServiceBridge:rpc(Ljava/lang/String;Ljava/util/Map;)Ljava/util/Map; : foundation.url.resolver.UrlResolutionException: RPC request 'supersedeBuildRun' failed: RELAY_ERROR - Handler error: RPC error: INTERNAL_ERROR - Cannot supersede build run '92e34eb6': it is already in terminal status FAILED. Only in-progress builds can be superseded. cause: null. The cancellation stays saved; retrying in 1920000ms.this service
6m 24s ago deliveryCodexCoder21Organization/PlanRepositoryGitHub delivered check_run.completed for CodexCoder21Organization/PlanRepository.github-merge-queue[bot]
6m 25s ago deliveryCodexCoder21Organization/PlanRepositoryGitHub delivered push for CodexCoder21Organization/PlanRepository.codexcoder21
6m 26s ago deliveryCodexCoder21Organization/PlanRepositoryGitHub delivered check_run.completed for CodexCoder21Organization/PlanRepository.github-merge-queue[bot]
6m 26s ago deliveryCodexCoder21Organization/PlanRepositoryGitHub delivered check_suite.completed for CodexCoder21Organization/PlanRepository.github-merge-queue[bot]
6m 27s ago deliveryCodexCoder21Organization/PlanRepositoryGitHub delivered check_run.created for CodexCoder21Organization/PlanRepository.github-merge-queue[bot]
6m 27s ago deliveryCodexCoder21Organization/PlanRepositoryGitHub delivered check_run.completed for CodexCoder21Organization/PlanRepository.github-merge-queue[bot]
6m 27s ago deliveryCodexCoder21Organization/PlanRepositoryGitHub delivered check_run.created for CodexCoder21Organization/PlanRepository.github-merge-queue[bot]
6m 28s ago deliveryCodexCoder21Organization/PlanRepositoryGitHub delivered check_run.created for CodexCoder21Organization/PlanRepository.github-merge-queue[bot]
6m 28s ago deliveryCodexCoder21Organization/PlanRepositoryGitHub delivered pull_request.dequeued for CodexCoder21Organization/PlanRepository.codexcoder21
6m 29s ago deliveryCodexCoder21Organization/PlanRepositoryGitHub delivered pull_request.closed for CodexCoder21Organization/PlanRepository.codexcoder21
6m 29s ago deliveryCodexCoder21Organization/PlanRepositoryGitHub delivered push for CodexCoder21Organization/PlanRepository.github-merge-queue[bot]
6m 29s ago skippedCodexCoder21Organization/PlanRepositoryThe 'kotlin.build (remote)' check already exists on CodexCoder21Organization/PlanRepository @ dbd0282561a8985a5a454cb7fb2e0effaef861b7, so this trigger created no second check.this service
6m 30s ago deliveryCodexCoder21Organization/PlanRepositoryGitHub delivered check_suite.requested for CodexCoder21Organization/PlanRepository.github-merge-queue[bot]
6m 30s ago deliveryCodexCoder21Organization/PlanRepositoryGitHub delivered push for CodexCoder21Organization/PlanRepository.github-merge-queue[bot]
6m 31s ago deliveryCodexCoder21Organization/PlanRepositoryGitHub delivered push for CodexCoder21Organization/PlanRepository.github-merge-queue[bot]
6m 46s ago deliveryCodexCoder21Organization/PlanRepositoryGitHub delivered pull_request.enqueued for CodexCoder21Organization/PlanRepository.codexcoder21
6m 51s ago deliveryCodexCoder21Organization/PlanRepositoryGitHub delivered check_run.completed for CodexCoder21Organization/PlanRepository.codexcoder21
6m 51s ago deliveryCodexCoder21Organization/PlanRepositoryGitHub delivered check_suite.completed for CodexCoder21Organization/PlanRepository.codexcoder21
6m 54s ago deliveryCodexCoder21Organization/PlanRepositoryGitHub delivered check_run.created for CodexCoder21Organization/PlanRepository.codexcoder21
6m 55s ago deliveryCodexCoder21Organization/PlanRepositoryGitHub delivered check_run.completed for CodexCoder21Organization/PlanRepository.codexcoder21
6m 55s ago deliveryCodexCoder21Organization/PlanRepositoryGitHub delivered check_suite.completed for CodexCoder21Organization/PlanRepository.codexcoder21
6m 58s ago deliveryCodexCoder21Organization/PlanRepositoryGitHub delivered check_run.created for CodexCoder21Organization/PlanRepository.codexcoder21
6m 58s ago deliveryCodexCoder21Organization/PlanRepositoryGitHub delivered pull_request.opened for CodexCoder21Organization/PlanRepository.codexcoder21
7m 0s ago deliveryCodexCoder21Organization/PlanRepositoryGitHub delivered check_suite.requested for CodexCoder21Organization/PlanRepository.codexcoder21
7m 0s ago deliveryCodexCoder21Organization/PlanRepositoryGitHub delivered push for CodexCoder21Organization/PlanRepository.codexcoder21
7m 1s ago deliveryCodexCoder21Organization/PlanRepositoryGitHub delivered push for CodexCoder21Organization/PlanRepository.codexcoder21
7m 50s ago build recovery failedCodexCoder21Organization/ContainerNurseryFailed to recover shadow check 118990623554: foundation.url.protocol.sandbox.SandboxException: Sandboxed code threw an exception: java.lang.InternalError: Exception encountered in implementation of foundation/url/sjvm/intrinsics/ServiceBridge:rpc(Ljava/lang/String;Ljava/util/Map;)Ljava/util/Map; : foundation.url.resolver.UrlResolutionException: RPC request 'finalizeUpload' failed: INTERNAL_ERROR - RPC error: -1 - IllegalStateException: Cannot run CI operation 'finalizeUpload' because the url://buildtest/ connection has not been established, and it did not come up within 20000ms of waiting. Retry once the server logs 'url://buildtest/ connection established; ingestion and CI orchestration enabled.' cause: null at foundation.url.resolver.sandbox.TypeMarshaling.fromJvmResult$foundation_url_resolver_sandbox(TypeMarshaling.kt:692) at foundation.url.resolver.sandbox.InstanceMethodDispatcher$invokeWithActivity$3.invoke(SandboxedProxyGenerator.kt:2106) at foundation.url.resolver.sandbox.InstanceMethodDispatcher$invokeWithActivity$3.invoke(SandboxedProxyGenerator.kt:2037) at foundation.url.resolver.sandbox.SandboxedProxyGeneratorKt$invokeSandboxMethod$future$1$result$1.invoke(SandboxedProxyGenerator.kt:1491) at community.kotlin.clocks.hierarchical.RequiredClockPadKt.withRequiredClockPad(RequiredClockPad.kt:89) at foundation.url.resolver.sandbox.SandboxedProxyGeneratorKt.invokeSandboxMethod$lambda$4(SandboxedProxyGenerator.kt:1491) at java.base/java.util.concurrent.FutureTask.run(FutureTask.java:317) at foundation.url.resolver.sandbox.SandboxInvocationLane.runScheduled(SandboxedProxyGenerator.kt:1379) at foundation.url.resolver.sandbox.SandboxInvocationLane.schedule$lambda$5(SandboxedProxyGenerator.kt:1370) at java.base/java.util.concurrent.ThreadPoolExecutor.runWorker(ThreadPoolExecutor.java:1144) at java.base/java.util.concurrent.ThreadPoolExecutor$Worker.run(ThreadPoolExecutor.java:642) at java.base/java.lang.Thread.run(Thread.java:1583) Caused by: java.lang.RuntimeException: java.lang.InternalError: Exception encountered in implementation of foundation/url/sjvm/intrinsics/ServiceBridge:rpc(Ljava/lang/String;Ljava/util/Map;)Ljava/util/Map; : foundation.url.resolver.UrlResolutionException: RPC request 'finalizeUpload' failed: INTERNAL_ERROR - RPC error: -1 - IllegalStateException: Cannot run CI operation 'finalizeUpload' because the url://buildtest/ connection has not been established, and it did not come up within 20000ms of waiting. Retry once the server logs 'url://buildtest/ connection established; ingestion and CI orchestration enabled.' at foundation.url.resolver.sandbox.TypeMarshaling.fromJvmResult$foundation_url_resolver_sandbox(TypeMarshaling.kt:695) ... 11 more this service
8m 8s ago skippedCodexCoder21Organization/BuildTestEmbeddedThe non-PR branch 'wip/flake-ci-hidden4-evidence' uses the wip/ checkpoint prefix, so this check_suite request started no build.this service
8m 8s ago deliveryCodexCoder21Organization/BuildTestEmbeddedGitHub delivered check_suite.requested for CodexCoder21Organization/BuildTestEmbedded.codexcoder21
8m 8s ago deliveryCodexCoder21Organization/BuildTestEmbeddedGitHub delivered push for CodexCoder21Organization/BuildTestEmbedded.codexcoder21
9m 11s ago deliveryCodexCoder21Organization/BuildTestProjectionJournalGitHub delivered check_run.completed for CodexCoder21Organization/BuildTestProjectionJournal.codexcoder21
9m 15s ago build remote stopCodexCoder21Organization/ContainerNurseryRemote stop attempt 17 for check run 123207798433 failed: foundation.url.protocol.sandbox.SandboxException: Sandboxed code threw an exception: java.lang.InternalError: Exception encountered in implementation of foundation/url/sjvm/intrinsics/ServiceBridge:rpc(Ljava/lang/String;Ljava/util/Map;)Ljava/util/Map; : foundation.url.resolver.UrlResolutionException: RPC request 'supersedeBuildRun' failed: RELAY_ERROR - Handler error: RPC error: INTERNAL_ERROR - Cannot supersede build run '450dd0a5': it is already in terminal status FAILED. Only in-progress builds can be superseded. cause: null. The cancellation stays saved; retrying in 1920000ms.this service
9m 15s ago build remote stopCodexCoder21Organization/HandoffEmbeddedRemote stop attempt 9 for check run 123396951958 failed: foundation.url.protocol.sandbox.SandboxException: Sandboxed code threw an exception: java.lang.InternalError: Exception encountered in implementation of foundation/url/sjvm/intrinsics/ServiceBridge:rpc(Ljava/lang/String;Ljava/util/Map;)Ljava/util/Map; : foundation.url.resolver.UrlResolutionException: RPC request 'supersedeBuildRun' failed: RELAY_ERROR - Handler error: RPC error: INTERNAL_ERROR - Cannot supersede build run 'fa1c8dfe': it is already in terminal status FAILED. Only in-progress builds can be superseded. cause: null. The cancellation stays saved; retrying in 1920000ms.this service
9m 16s ago build remote stopCodexCoder21Organization/HandoffWuiRemote stop attempt 16 for check run 123239157056 failed: foundation.url.protocol.sandbox.SandboxException: Sandboxed code threw an exception: java.lang.InternalError: Exception encountered in implementation of foundation/url/sjvm/intrinsics/ServiceBridge:rpc(Ljava/lang/String;Ljava/util/Map;)Ljava/util/Map; : foundation.url.resolver.UrlResolutionException: RPC request 'supersedeBuildRun' failed: RELAY_ERROR - Handler error: RPC error: INTERNAL_ERROR - Cannot supersede build run '9b951e23': it is already in terminal status FAILED. Only in-progress builds can be superseded. cause: null. The cancellation stays saved; retrying in 1920000ms.this service
9m 16s ago build remote stopCodexCoder21Organization/UrlResolverRemote stop attempt 18 for check run 123960525556 failed: foundation.url.protocol.sandbox.SandboxException: Sandboxed code threw an exception: java.lang.InternalError: Exception encountered in implementation of foundation/url/sjvm/intrinsics/ServiceBridge:rpc(Ljava/lang/String;Ljava/util/Map;)Ljava/util/Map; : foundation.url.resolver.UrlResolutionException: RPC request 'supersedeBuildRun' failed: RELAY_ERROR - Handler error: RPC error: INTERNAL_ERROR - Cannot supersede build run '5c92ae50': it is already in terminal status FAILED. Only in-progress builds can be superseded. cause: null. The cancellation stays saved; retrying in 1920000ms.this service
9m 51s ago skippedCodexCoder21Organization/BuildTestEmbeddedThe non-PR branch 'wip/flake-ci-hidden4-evidence' uses the wip/ checkpoint prefix, so this check_suite request started no build.this service
9m 51s ago deliveryCodexCoder21Organization/BuildTestEmbeddedGitHub delivered check_suite.requested for CodexCoder21Organization/BuildTestEmbedded.codexcoder21
9m 51s ago deliveryCodexCoder21Organization/BuildTestEmbeddedGitHub delivered push for CodexCoder21Organization/BuildTestEmbedded.codexcoder21
9m 55s ago build remote stopCodexCoder21Organization/HandoffWuiRemote stop attempt 10 for check run 123354638194 failed: foundation.url.protocol.sandbox.SandboxException: Sandboxed code threw an exception: java.lang.InternalError: Exception encountered in implementation of foundation/url/sjvm/intrinsics/ServiceBridge:rpc(Ljava/lang/String;Ljava/util/Map;)Ljava/util/Map; : foundation.url.resolver.UrlResolutionException: RPC request 'supersedeBuildRun' failed: RELAY_ERROR - Handler error: RPC error: INTERNAL_ERROR - Cannot supersede build run 'e866c633': it is already in terminal status FAILED. Only in-progress builds can be superseded. cause: null. The cancellation stays saved; retrying in 1920000ms.this service
10m 7s ago build pendingCodexCoder21Organization/BuildTestProjectionJournalRemote run dabf37c1 remains PENDING after 8s of queue wait; waiting for buildtest admission.this service
10m 11s ago deliveryCodexCoder21Organization/BuildTestProjectionJournalGitHub delivered check_run.created for CodexCoder21Organization/BuildTestProjectionJournal.codexcoder21
10m 13s ago deliveryCodexCoder21Organization/BuildTestEmbeddedGitHub delivered pull_request.edited for CodexCoder21Organization/BuildTestEmbedded.codexcoder21
10m 13s ago build remote stopCodexCoder21Organization/AiCliHostSupervisorDaemonEmbeddedRemote stop attempt 13 for check run 123138706939 failed: foundation.url.protocol.sandbox.SandboxException: Sandboxed code threw an exception: java.lang.InternalError: Exception encountered in implementation of foundation/url/sjvm/intrinsics/ServiceBridge:rpc(Ljava/lang/String;Ljava/util/Map;)Ljava/util/Map; : foundation.url.resolver.UrlResolutionException: RPC request 'supersedeBuildRun' failed: RELAY_ERROR - Handler error: RPC error: INTERNAL_ERROR - Cannot supersede build run 'bed8f131': it is already in terminal status FAILED. Only in-progress builds can be superseded. cause: null. The cancellation stays saved; retrying in 1920000ms.this service
10m 13s ago build remote stopCodexCoder21Organization/BuildTestProjectionJournalRemote stop attempt 14 for check run 123920497196 failed: foundation.url.protocol.sandbox.SandboxException: Sandboxed code threw an exception: java.lang.InternalError: Exception encountered in implementation of foundation/url/sjvm/intrinsics/ServiceBridge:rpc(Ljava/lang/String;Ljava/util/Map;)Ljava/util/Map; : foundation.url.resolver.UrlResolutionException: RPC request 'supersedeBuildRun' failed: RELAY_ERROR - Handler error: RPC error: INTERNAL_ERROR - Cannot supersede build run '07fd652e': it is already in terminal status FAILED. Only in-progress builds can be superseded. cause: null. The cancellation stays saved; retrying in 1920000ms.this service
10m 14s ago build remote stopCodexCoder21Organization/BuildTestProjectionJournalRemote stop attempt 9 for check run 124391777713 failed: foundation.url.protocol.sandbox.SandboxException: Sandboxed code threw an exception: java.lang.InternalError: Exception encountered in implementation of foundation/url/sjvm/intrinsics/ServiceBridge:rpc(Ljava/lang/String;Ljava/util/Map;)Ljava/util/Map; : foundation.url.resolver.UrlResolutionException: RPC request 'supersedeBuildRun' failed: RELAY_ERROR - Handler error: RPC error: INTERNAL_ERROR - Cannot supersede build run 'baaf20ed': it is already in terminal status FAILED. Only in-progress builds can be superseded. cause: null. The cancellation stays saved; retrying in 1920000ms.this service
10m 15s ago dispatchedCodexCoder21Organization/BuildTestProjectionJournalSubmitted to the direct-buildtest build service.this service
10m 17s ago deliveryCodexCoder21Organization/BuildTestProjectionJournalGitHub delivered check_run.created for CodexCoder21Organization/BuildTestProjectionJournal.codexcoder21
10m 18s ago deliveryCodexCoder21Organization/BuildTestProjectionJournalGitHub delivered check_run.created for CodexCoder21Organization/BuildTestProjectionJournal.codexcoder21
10m 20s ago deliveryCodexCoder21Organization/BuildTestProjectionJournalGitHub delivered pull_request.edited for CodexCoder21Organization/BuildTestProjectionJournal.codexcoder21
10m 21s ago deliveryCodexCoder21Organization/BuildTestProjectionJournalGitHub delivered pull_request.synchronize for CodexCoder21Organization/BuildTestProjectionJournal.codexcoder21
10m 23s ago deliveryCodexCoder21Organization/BuildTestProjectionJournalGitHub delivered check_suite.requested for CodexCoder21Organization/BuildTestProjectionJournal.codexcoder21
10m 23s ago deliveryCodexCoder21Organization/BuildTestProjectionJournalGitHub delivered push for CodexCoder21Organization/BuildTestProjectionJournal.codexcoder21
10m 46s ago deliveryCodexCoder21Organization/BuildTestProjectionJournalGitHub delivered check_suite.completed for CodexCoder21Organization/BuildTestProjectionJournal.codexcoder21
10m 46s ago deliveryCodexCoder21Organization/BuildTestProjectionJournalGitHub delivered check_run.completed for CodexCoder21Organization/BuildTestProjectionJournal.codexcoder21
10m 48s ago completedCodexCoder21Organization/BuildTestProjectionJournalAll tests passing (619/619)this service
10m 59s ago deliveryCodexCoder21Organization/BuildTestProjectionJournalGitHub delivered check_run.completed for CodexCoder21Organization/BuildTestProjectionJournal.codexcoder21
10m 59s ago deliveryCodexCoder21Organization/BuildTestProjectionJournalGitHub delivered check_suite.completed for CodexCoder21Organization/BuildTestProjectionJournal.codexcoder21
11m 21s ago build remote stopCodexCoder21Organization/HandoffApiRemote stop attempt 9 for check run 123238567626 failed: foundation.url.protocol.sandbox.SandboxException: Sandboxed code threw an exception: java.lang.InternalError: Exception encountered in implementation of foundation/url/sjvm/intrinsics/ServiceBridge:rpc(Ljava/lang/String;Ljava/util/Map;)Ljava/util/Map; : foundation.url.resolver.UrlResolutionException: RPC request 'supersedeBuildRun' failed: RELAY_ERROR - Handler error: RPC error: INTERNAL_ERROR - Cannot supersede build run '90a86911': it is already in terminal status FAILED. Only in-progress builds can be superseded. cause: null. The cancellation stays saved; retrying in 1920000ms.this service
11m 21s ago build remote stopCodexCoder21Organization/UrlResolverRemote stop attempt 27 for check run 122046058155 failed: foundation.url.protocol.sandbox.SandboxException: Sandboxed code threw an exception: java.lang.InternalError: Exception encountered in implementation of foundation/url/sjvm/intrinsics/ServiceBridge:rpc(Ljava/lang/String;Ljava/util/Map;)Ljava/util/Map; : foundation.url.resolver.UrlResolutionException: RPC request 'supersedeBuildRun' failed: RELAY_ERROR - Handler error: RPC error: INTERNAL_ERROR - Cannot supersede build run '54b54f2d': it is already in terminal status FAILED. Only in-progress builds can be superseded. cause: null. The cancellation stays saved; retrying in 1920000ms.this service
11m 21s ago build remote stopCodexCoder21Organization/BuildTestProjectionJournalRemote stop attempt 9 for check run 123904636467 failed: foundation.url.protocol.sandbox.SandboxException: Sandboxed code threw an exception: java.lang.InternalError: Exception encountered in implementation of foundation/url/sjvm/intrinsics/ServiceBridge:rpc(Ljava/lang/String;Ljava/util/Map;)Ljava/util/Map; : foundation.url.resolver.UrlResolutionException: RPC request 'supersedeBuildRun' failed: RELAY_ERROR - Handler error: RPC error: INTERNAL_ERROR - Cannot supersede build run 'd1923e44': it is already in terminal status CANCELED. Only in-progress builds can be superseded. cause: null. The cancellation stays saved; retrying in 1920000ms.this service
11m 24s ago skippedCodexCoder21Organization/BuildTestProjectionJournalThe non-PR branch 'wip/journal-incomplete-baseline1-evidence' uses the wip/ checkpoint prefix, so this check_suite request started no build.this service
11m 24s ago deliveryCodexCoder21Organization/BuildTestProjectionJournalGitHub delivered check_suite.requested for CodexCoder21Organization/BuildTestProjectionJournal.codexcoder21
11m 26s ago deliveryCodexCoder21Organization/BuildTestProjectionJournalGitHub delivered push for CodexCoder21Organization/BuildTestProjectionJournal.codexcoder21
11m 35s ago skippedCodexCoder21Organization/BuildTestEmbeddedThe non-PR branch 'wip/fix1737-p3-evidence' uses the wip/ checkpoint prefix, so this check_suite request started no build.this service
11m 35s ago deliveryCodexCoder21Organization/BuildTestEmbeddedGitHub delivered check_suite.requested for CodexCoder21Organization/BuildTestEmbedded.codexcoder21
11m 36s ago deliveryCodexCoder21Organization/BuildTestEmbeddedGitHub delivered push for CodexCoder21Organization/BuildTestEmbedded.codexcoder21
11m 50s ago build remote stopCodexCoder21Organization/HandoffWuiRemote stop attempt 8 for check run 123337002093 failed: foundation.url.protocol.sandbox.SandboxException: Sandboxed code threw an exception: java.lang.InternalError: Exception encountered in implementation of foundation/url/sjvm/intrinsics/ServiceBridge:rpc(Ljava/lang/String;Ljava/util/Map;)Ljava/util/Map; : foundation.url.resolver.UrlResolutionException: RPC request 'supersedeBuildRun' failed: RELAY_ERROR - Handler error: RPC error: INTERNAL_ERROR - Cannot supersede build run '1c4a6f64': it is already in terminal status FAILED. Only in-progress builds can be superseded. cause: null. The cancellation stays saved; retrying in 1920000ms.this service
11m 51s ago skippedCodexCoder21Organization/BuildTestEmbeddedThe non-PR branch 'wip/fix1737-p3-ckpt' uses the wip/ checkpoint prefix, so this check_suite request started no build.this service
11m 51s ago deliveryCodexCoder21Organization/BuildTestEmbeddedGitHub delivered check_suite.requested for CodexCoder21Organization/BuildTestEmbedded.codexcoder21
11m 51s ago build remote stopCodexCoder21Organization/DigitalOceanDropletServiceServerRemote stop attempt 203 for check run 119780498054 failed: foundation.url.protocol.sandbox.SandboxException: Sandboxed code threw an exception: java.lang.InternalError: Exception encountered in implementation of foundation/url/sjvm/intrinsics/ServiceBridge:rpc(Ljava/lang/String;Ljava/util/Map;)Ljava/util/Map; : foundation.url.resolver.UrlResolutionException: RPC request 'supersedeBuildRun' failed: RELAY_ERROR - Handler error: RPC error: INTERNAL_ERROR - Cannot supersede build run '7c2cc037': it is already in terminal status FAILED. Only in-progress builds can be superseded. cause: null. The cancellation stays saved; retrying in 1920000ms.this service
11m 53s ago deliveryCodexCoder21Organization/BuildTestEmbeddedGitHub delivered push for CodexCoder21Organization/BuildTestEmbedded.codexcoder21
12m 32s ago build remote stopCodexCoder21Organization/HandoffWuiRemote stop attempt 11 for check run 123249633010 failed: foundation.url.protocol.sandbox.SandboxException: Sandboxed code threw an exception: java.lang.InternalError: Exception encountered in implementation of foundation/url/sjvm/intrinsics/ServiceBridge:rpc(Ljava/lang/String;Ljava/util/Map;)Ljava/util/Map; : foundation.url.resolver.UrlResolutionException: RPC request 'supersedeBuildRun' failed: RELAY_ERROR - Handler error: RPC error: INTERNAL_ERROR - Cannot supersede build run 'fcafddde': it is already in terminal status FAILED. Only in-progress builds can be superseded. cause: null. The cancellation stays saved; retrying in 1920000ms.this service
12m 51s ago build remote stopCodexCoder21Organization/PerformanceTestServerServiceRemote stop attempt 8 for check run 123414784896 failed: foundation.url.protocol.sandbox.SandboxException: Sandboxed code threw an exception: java.lang.InternalError: Exception encountered in implementation of foundation/url/sjvm/intrinsics/ServiceBridge:rpc(Ljava/lang/String;Ljava/util/Map;)Ljava/util/Map; : foundation.url.resolver.UrlResolutionException: RPC request 'supersedeBuildRun' failed: RELAY_ERROR - Handler error: RPC error: INTERNAL_ERROR - Cannot supersede build run '36ae7182': it is already in terminal status FAILED. Only in-progress builds can be superseded. cause: null. The cancellation stays saved; retrying in 1920000ms.this service
13m 1s ago deliveryCodexCoder21Organization/BuildTestEmbeddedGitHub delivered check_run.created for CodexCoder21Organization/BuildTestEmbedded.codexcoder21
13m 2s ago deliveryCodexCoder21Organization/BuildTestEmbeddedGitHub delivered check_run.created for CodexCoder21Organization/BuildTestEmbedded.codexcoder21
13m 2s ago deliveryCodexCoder21Organization/BuildTestEmbeddedGitHub delivered check_run.created for CodexCoder21Organization/BuildTestEmbedded.codexcoder21
13m 2s ago deliveryCodexCoder21Organization/BuildTestEmbeddedGitHub delivered check_run.created for CodexCoder21Organization/BuildTestEmbedded.codexcoder21
13m 2s ago deliveryCodexCoder21Organization/BuildTestEmbeddedGitHub delivered check_run.created for CodexCoder21Organization/BuildTestEmbedded.codexcoder21
13m 2s ago deliveryCodexCoder21Organization/BuildTestEmbeddedGitHub delivered check_run.created for CodexCoder21Organization/BuildTestEmbedded.codexcoder21
13m 2s ago deliveryCodexCoder21Organization/BuildTestEmbeddedGitHub delivered check_run.created for CodexCoder21Organization/BuildTestEmbedded.codexcoder21
13m 2s ago deliveryCodexCoder21Organization/BuildTestEmbeddedGitHub delivered check_run.created for CodexCoder21Organization/BuildTestEmbedded.codexcoder21
13m 2s ago deliveryCodexCoder21Organization/BuildTestEmbeddedGitHub delivered check_run.created for CodexCoder21Organization/BuildTestEmbedded.codexcoder21
13m 2s ago deliveryCodexCoder21Organization/BuildTestEmbeddedGitHub delivered check_run.created for CodexCoder21Organization/BuildTestEmbedded.codexcoder21
13m 2s ago deliveryCodexCoder21Organization/BuildTestEmbeddedGitHub delivered check_run.created for CodexCoder21Organization/BuildTestEmbedded.codexcoder21
13m 2s ago deliveryCodexCoder21Organization/BuildTestEmbeddedGitHub delivered check_run.created for CodexCoder21Organization/BuildTestEmbedded.codexcoder21
13m 2s ago deliveryCodexCoder21Organization/BuildTestEmbeddedGitHub delivered check_run.created for CodexCoder21Organization/BuildTestEmbedded.codexcoder21
13m 2s ago deliveryCodexCoder21Organization/BuildTestEmbeddedGitHub delivered check_run.created for CodexCoder21Organization/BuildTestEmbedded.codexcoder21
13m 2s ago deliveryCodexCoder21Organization/BuildTestEmbeddedGitHub delivered check_run.created for CodexCoder21Organization/BuildTestEmbedded.codexcoder21
13m 2s ago deliveryCodexCoder21Organization/BuildTestEmbeddedGitHub delivered check_run.created for CodexCoder21Organization/BuildTestEmbedded.codexcoder21
13m 5s ago deliveryCodexCoder21Organization/BuildTestEmbeddedGitHub delivered pull_request.opened for CodexCoder21Organization/BuildTestEmbedded.codexcoder21
13m 7s ago deliveryCodexCoder21Organization/BuildTestEmbeddedGitHub delivered check_suite.requested for CodexCoder21Organization/BuildTestEmbedded.codexcoder21
13m 9s ago deliveryCodexCoder21Organization/BuildTestEmbeddedGitHub delivered push for CodexCoder21Organization/BuildTestEmbedded.codexcoder21
13m 9s ago build remote stopCodexCoder21Organization/UrlResolverRemote stop attempt 10 for check run 122926575025 failed: foundation.url.protocol.sandbox.SandboxException: Sandboxed code threw an exception: java.lang.InternalError: Exception encountered in implementation of foundation/url/sjvm/intrinsics/ServiceBridge:rpc(Ljava/lang/String;Ljava/util/Map;)Ljava/util/Map; : foundation.url.resolver.UrlResolutionException: RPC request 'supersedeBuildRun' failed: RELAY_ERROR - Handler error: RPC error: INTERNAL_ERROR - Cannot supersede build run '6a1d2cb7': it is already in terminal status FAILED. Only in-progress builds can be superseded. cause: null. The cancellation stays saved; retrying in 1920000ms.this service
13m 9s ago build remote stopCodexCoder21Organization/HandoffWuiRemote stop attempt 9 for check run 123333269820 failed: foundation.url.protocol.sandbox.SandboxException: Sandboxed code threw an exception: java.lang.InternalError: Exception encountered in implementation of foundation/url/sjvm/intrinsics/ServiceBridge:rpc(Ljava/lang/String;Ljava/util/Map;)Ljava/util/Map; : foundation.url.resolver.UrlResolutionException: RPC request 'supersedeBuildRun' failed: RELAY_ERROR - Handler error: RPC error: INTERNAL_ERROR - Cannot supersede build run '77ce55f9': it is already in terminal status FAILED. Only in-progress builds can be superseded. cause: null. The cancellation stays saved; retrying in 1920000ms.this service
13m 9s ago build remote stopCodexCoder21Organization/ContainerNurseryRemote stop attempt 21 for check run 123189389727 failed: foundation.url.protocol.sandbox.SandboxException: Sandboxed code threw an exception: java.lang.InternalError: Exception encountered in implementation of foundation/url/sjvm/intrinsics/ServiceBridge:rpc(Ljava/lang/String;Ljava/util/Map;)Ljava/util/Map; : foundation.url.resolver.UrlResolutionException: RPC request 'supersedeBuildRun' failed: RELAY_ERROR - Handler error: RPC error: INTERNAL_ERROR - Cannot supersede build run 'f4a3ed31': it is already in terminal status FAILED. Only in-progress builds can be superseded. cause: null. The cancellation stays saved; retrying in 1920000ms.this service
13m 29s ago build remote stopCodexCoder21Organization/HandoffApiRemote stop attempt 9 for check run 123241277637 failed: foundation.url.protocol.sandbox.SandboxException: Sandboxed code threw an exception: java.lang.InternalError: Exception encountered in implementation of foundation/url/sjvm/intrinsics/ServiceBridge:rpc(Ljava/lang/String;Ljava/util/Map;)Ljava/util/Map; : foundation.url.resolver.UrlResolutionException: RPC request 'supersedeBuildRun' failed: RELAY_ERROR - Handler error: RPC error: INTERNAL_ERROR - Cannot supersede build run '081b5458': it is already in terminal status FAILED. Only in-progress builds can be superseded. cause: null. The cancellation stays saved; retrying in 1920000ms.this service
14m 38s ago skippedCodexCoder21Organization/BuildTestEmbeddedThe non-PR branch 'wip/flake-ci-hidden4-ckpt' uses the wip/ checkpoint prefix, so this check_suite request started no build.this service
14m 38s ago deliveryCodexCoder21Organization/BuildTestEmbeddedGitHub delivered check_suite.requested for CodexCoder21Organization/BuildTestEmbedded.codexcoder21
14m 39s ago deliveryCodexCoder21Organization/BuildTestEmbeddedGitHub delivered push for CodexCoder21Organization/BuildTestEmbedded.codexcoder21
14m 53s ago build recovery failedCodexCoder21Organization/TinySiteWuiFailed to recover shadow check 118989001763: foundation.url.protocol.sandbox.SandboxException: Sandboxed code threw an exception: java.lang.InternalError: Exception encountered in implementation of foundation/url/sjvm/intrinsics/ServiceBridge:rpc(Ljava/lang/String;Ljava/util/Map;)Ljava/util/Map; : foundation.url.resolver.UrlResolutionException: RPC request 'finalizeUpload' failed: INTERNAL_ERROR - RPC error: -1 - IllegalStateException: Cannot run CI operation 'finalizeUpload' because the url://buildtest/ connection has not been established, and it did not come up within 20000ms of waiting. Retry once the server logs 'url://buildtest/ connection established; ingestion and CI orchestration enabled.' cause: null at foundation.url.resolver.sandbox.TypeMarshaling.fromJvmResult$foundation_url_resolver_sandbox(TypeMarshaling.kt:692) at foundation.url.resolver.sandbox.InstanceMethodDispatcher$invokeWithActivity$3.invoke(SandboxedProxyGenerator.kt:2106) at foundation.url.resolver.sandbox.InstanceMethodDispatcher$invokeWithActivity$3.invoke(SandboxedProxyGenerator.kt:2037) at foundation.url.resolver.sandbox.SandboxedProxyGeneratorKt$invokeSandboxMethod$future$1$result$1.invoke(SandboxedProxyGenerator.kt:1491) at community.kotlin.clocks.hierarchical.RequiredClockPadKt.withRequiredClockPad(RequiredClockPad.kt:89) at foundation.url.resolver.sandbox.SandboxedProxyGeneratorKt.invokeSandboxMethod$lambda$4(SandboxedProxyGenerator.kt:1491) at java.base/java.util.concurrent.FutureTask.run(FutureTask.java:317) at foundation.url.resolver.sandbox.SandboxInvocationLane.runScheduled(SandboxedProxyGenerator.kt:1379) at foundation.url.resolver.sandbox.SandboxInvocationLane.schedule$lambda$5(SandboxedProxyGenerator.kt:1370) at java.base/java.util.concurrent.ThreadPoolExecutor.runWorker(ThreadPoolExecutor.java:1144) at java.base/java.util.concurrent.ThreadPoolExecutor$Worker.run(ThreadPoolExecutor.java:642) at java.base/java.lang.Thread.run(Thread.java:1583) Caused by: java.lang.RuntimeException: java.lang.InternalError: Exception encountered in implementation of foundation/url/sjvm/intrinsics/ServiceBridge:rpc(Ljava/lang/String;Ljava/util/Map;)Ljava/util/Map; : foundation.url.resolver.UrlResolutionException: RPC request 'finalizeUpload' failed: INTERNAL_ERROR - RPC error: -1 - IllegalStateException: Cannot run CI operation 'finalizeUpload' because the url://buildtest/ connection has not been established, and it did not come up within 20000ms of waiting. Retry once the server logs 'url://buildtest/ connection established; ingestion and CI orchestration enabled.' at foundation.url.resolver.sandbox.TypeMarshaling.fromJvmResult$foundation_url_resolver_sandbox(TypeMarshaling.kt:695) ... 11 more this service
15m 6s ago skippedCodexCoder21Organization/BuildTestProjectionJournalThe non-PR branch 'wip/fix99-p4-evidence' uses the wip/ checkpoint prefix, so this check_suite request started no build.this service
15m 6s ago deliveryCodexCoder21Organization/BuildTestProjectionJournalGitHub delivered check_suite.requested for CodexCoder21Organization/BuildTestProjectionJournal.codexcoder21
15m 6s ago deliveryCodexCoder21Organization/BuildTestProjectionJournalGitHub delivered push for CodexCoder21Organization/BuildTestProjectionJournal.codexcoder21
15m 36s ago build remote stopCodexCoder21Organization/HandoffWuiRemote stop attempt 16 for check run 123238550739 failed: foundation.url.protocol.sandbox.SandboxException: Sandboxed code threw an exception: java.lang.InternalError: Exception encountered in implementation of foundation/url/sjvm/intrinsics/ServiceBridge:rpc(Ljava/lang/String;Ljava/util/Map;)Ljava/util/Map; : foundation.url.resolver.UrlResolutionException: RPC request 'supersedeBuildRun' failed: RELAY_ERROR - Handler error: RPC error: INTERNAL_ERROR - Cannot supersede build run '4020b882': it is already in terminal status FAILED. Only in-progress builds can be superseded. cause: null. The cancellation stays saved; retrying in 1920000ms.this service
16m 23s ago build remote stopCodexCoder21Organization/UrlProtocolRemote stop attempt 187 for check run 120372234309 failed: foundation.url.protocol.sandbox.SandboxException: Sandboxed code threw an exception: java.lang.InternalError: Exception encountered in implementation of foundation/url/sjvm/intrinsics/ServiceBridge:rpc(Ljava/lang/String;Ljava/util/Map;)Ljava/util/Map; : foundation.url.resolver.UrlResolutionException: RPC request 'supersedeBuildRun' failed: RELAY_ERROR - Handler error: RPC error: INTERNAL_ERROR - Cannot supersede build run '2e36ffaf': it is already in terminal status FAILED. Only in-progress builds can be superseded. cause: null. The cancellation stays saved; retrying in 1920000ms.this service
16m 24s ago build remote stopCodexCoder21Organization/ContainerNurseryRemote stop attempt 12 for check run 122894390167 failed: foundation.url.protocol.sandbox.SandboxException: Sandboxed code threw an exception: java.lang.InternalError: Exception encountered in implementation of foundation/url/sjvm/intrinsics/ServiceBridge:rpc(Ljava/lang/String;Ljava/util/Map;)Ljava/util/Map; : foundation.url.resolver.UrlResolutionException: RPC request 'supersedeBuildRun' failed: RELAY_ERROR - Handler error: RPC error: INTERNAL_ERROR - Cannot supersede build run '23e82d63': it is already in terminal status FAILED. Only in-progress builds can be superseded. cause: null. The cancellation stays saved; retrying in 1920000ms.this service
16m 25s ago build remote stopCodexCoder21Organization/PerformanceTestServerServiceRemote stop attempt 11 for check run 123333491531 failed: foundation.url.protocol.sandbox.SandboxException: Sandboxed code threw an exception: java.lang.InternalError: Exception encountered in implementation of foundation/url/sjvm/intrinsics/ServiceBridge:rpc(Ljava/lang/String;Ljava/util/Map;)Ljava/util/Map; : foundation.url.resolver.UrlResolutionException: RPC request 'supersedeBuildRun' failed: RELAY_ERROR - Handler error: RPC error: INTERNAL_ERROR - Cannot supersede build run '14a9a396': it is already in terminal status COMPLETED. Only in-progress builds can be superseded. cause: null. The cancellation stays saved; retrying in 1920000ms.this service
16m 25s ago build remote stopCodexCoder21Organization/BuildTestProjectionJournalRemote stop attempt 9 for check run 124131574870 failed: foundation.url.protocol.sandbox.SandboxException: Sandboxed code threw an exception: java.lang.InternalError: Exception encountered in implementation of foundation/url/sjvm/intrinsics/ServiceBridge:rpc(Ljava/lang/String;Ljava/util/Map;)Ljava/util/Map; : foundation.url.resolver.UrlResolutionException: RPC request 'supersedeBuildRun' failed: RELAY_ERROR - Handler error: RPC error: INTERNAL_ERROR - Cannot supersede build run '01ead0a1': it is already in terminal status FAILED. Only in-progress builds can be superseded. cause: null. The cancellation stays saved; retrying in 1920000ms.this service
17m 28s ago deliveryCodexCoder21Organization/BuildTestProjectionJournalGitHub delivered check_run.completed for CodexCoder21Organization/BuildTestProjectionJournal.codexcoder21
17m 28s ago deliveryCodexCoder21Organization/BuildTestProjectionJournalGitHub delivered check_suite.completed for CodexCoder21Organization/BuildTestProjectionJournal.codexcoder21
17m 30s ago completedCodexCoder21Organization/BuildTestProjectionJournalAll tests passing (237/237)this service
17m 31s ago deliveryCodexCoder21Organization/BuildTestEmbeddedGitHub delivered check_suite.completed for CodexCoder21Organization/BuildTestEmbedded.codexcoder21
17m 31s ago deliveryCodexCoder21Organization/BuildTestEmbeddedGitHub delivered check_run.completed for CodexCoder21Organization/BuildTestEmbedded.codexcoder21
17m 37s ago build remote stopCodexCoder21Organization/UrlResolverRemote stop attempt 22 for check run 122357743624 failed: foundation.url.protocol.sandbox.SandboxException: Sandboxed code threw an exception: java.lang.InternalError: Exception encountered in implementation of foundation/url/sjvm/intrinsics/ServiceBridge:rpc(Ljava/lang/String;Ljava/util/Map;)Ljava/util/Map; : foundation.url.resolver.UrlResolutionException: RPC request 'cancelBuildRun' failed: RELAY_ERROR - Handler error: RPC error: INTERNAL_ERROR - Cannot cancel build run '38b55904': it is already in terminal status CANCELED. Only in-progress builds can be cancelled. cause: null. The cancellation stays saved; retrying in 1920000ms.this service
17m 45s ago deliveryCodexCoder21Organization/BuildTestEmbeddedGitHub delivered check_run.completed for CodexCoder21Organization/BuildTestEmbedded.codexcoder21
17m 45s ago deliveryCodexCoder21Organization/BuildTestEmbeddedGitHub delivered check_run.created for CodexCoder21Organization/BuildTestEmbedded.codexcoder21
17m 56s ago deliveryCodexCoder21Organization/BuildTestEmbeddedGitHub delivered check_run.completed for CodexCoder21Organization/BuildTestEmbedded.codexcoder21
18m 57s ago deliveryCodexCoder21Organization/BuildTestEmbeddedGitHub delivered check_run.completed for CodexCoder21Organization/BuildTestEmbedded.codexcoder21
19m 1s ago build remote stopCodexCoder21Organization/BuildTestProjectionJournalRemote stop attempt 8 for check run 124391777713 failed: foundation.url.protocol.sandbox.SandboxException: Sandboxed code threw an exception: java.lang.InternalError: Exception encountered in implementation of foundation/url/sjvm/intrinsics/ServiceBridge:rpc(Ljava/lang/String;Ljava/util/Map;)Ljava/util/Map; : foundation.url.resolver.UrlResolutionException: RPC request 'supersedeBuildRun' failed: RELAY_ERROR - Handler error: RPC error: INTERNAL_ERROR - Cannot supersede build run 'baaf20ed': it is already in terminal status FAILED. Only in-progress builds can be superseded. cause: null. The cancellation stays saved; retrying in 1920000ms.this service
19m 1s ago build remote stopCodexCoder21Organization/AiCliHostSupervisorDaemonEmbeddedRemote stop attempt 12 for check run 123218537086 failed: foundation.url.protocol.sandbox.SandboxException: Sandboxed code threw an exception: java.lang.InternalError: Exception encountered in implementation of foundation/url/sjvm/intrinsics/ServiceBridge:rpc(Ljava/lang/String;Ljava/util/Map;)Ljava/util/Map; : foundation.url.resolver.UrlResolutionException: RPC request 'supersedeBuildRun' failed: RELAY_ERROR - Handler error: RPC error: INTERNAL_ERROR - Cannot supersede build run '04e84303': it is already in terminal status FAILED. Only in-progress builds can be superseded. cause: null. The cancellation stays saved; retrying in 1920000ms.this service
19m 14s ago deliveryCodexCoder21Organization/BuildTestEmbeddedGitHub delivered check_run.completed for CodexCoder21Organization/BuildTestEmbedded.codexcoder21
19m 31s ago build remote stopCodexCoder21Organization/BuildTestProjectionJournalRemote stop attempt 9 for check run 123219567311 failed: foundation.url.protocol.sandbox.SandboxException: Sandboxed code threw an exception: java.lang.InternalError: Exception encountered in implementation of foundation/url/sjvm/intrinsics/ServiceBridge:rpc(Ljava/lang/String;Ljava/util/Map;)Ljava/util/Map; : foundation.url.resolver.UrlResolutionException: RPC request 'supersedeBuildRun' failed: RELAY_ERROR - Handler error: RPC error: INTERNAL_ERROR - Cannot supersede build run '76090d0f': it is already in terminal status FAILED. Only in-progress builds can be superseded. cause: null. The cancellation stays saved; retrying in 1920000ms.this service
20m 7s ago deliveryCodexCoder21Organization/BuildTestEmbeddedGitHub delivered check_run.completed for CodexCoder21Organization/BuildTestEmbedded.codexcoder21
20m 14s ago build remote stopCodexCoder21Organization/AiCliHostSupervisorDaemonEmbeddedRemote stop attempt 8 for check run 123302470327 failed: foundation.url.protocol.sandbox.SandboxException: Sandboxed code threw an exception: java.lang.InternalError: Exception encountered in implementation of foundation/url/sjvm/intrinsics/ServiceBridge:rpc(Ljava/lang/String;Ljava/util/Map;)Ljava/util/Map; : foundation.url.resolver.UrlResolutionException: RPC request 'supersedeBuildRun' failed: RELAY_ERROR - Handler error: RPC error: INTERNAL_ERROR - Cannot supersede build run 'e7c314f8': it is already in terminal status FAILED. Only in-progress builds can be superseded. cause: null. The cancellation stays saved; retrying in 1920000ms.this service
20m 47s ago deliveryCodexCoder21Organization/BuildTestEmbeddedGitHub delivered check_run.completed for CodexCoder21Organization/BuildTestEmbedded.codexcoder21
20m 52s ago build remote stopCodexCoder21Organization/DigitalOceanDropletServiceServerRemote stop attempt 211 for check run 119780872316 failed: foundation.url.protocol.sandbox.SandboxException: Sandboxed code threw an exception: java.lang.InternalError: Exception encountered in implementation of foundation/url/sjvm/intrinsics/ServiceBridge:rpc(Ljava/lang/String;Ljava/util/Map;)Ljava/util/Map; : foundation.url.resolver.UrlResolutionException: RPC request 'supersedeBuildRun' failed: RELAY_ERROR - Handler error: RPC error: INTERNAL_ERROR - Cannot supersede build run '1bbc84f0': it is already in terminal status FAILED. Only in-progress builds can be superseded. cause: null. The cancellation stays saved; retrying in 1920000ms.this service
20m 53s ago build remote stopCodexCoder21Organization/UrlResolverRemote stop attempt 13 for check run 123302721770 failed: foundation.url.protocol.sandbox.SandboxException: Sandboxed code threw an exception: java.lang.InternalError: Exception encountered in implementation of foundation/url/sjvm/intrinsics/ServiceBridge:rpc(Ljava/lang/String;Ljava/util/Map;)Ljava/util/Map; : foundation.url.resolver.UrlResolutionException: RPC request 'supersedeBuildRun' failed: RELAY_ERROR - Handler error: RPC error: INTERNAL_ERROR - Cannot supersede build run '94944b36': it is already in terminal status FAILED. Only in-progress builds can be superseded. cause: null. The cancellation stays saved; retrying in 1920000ms.this service
20m 53s ago build remote stopCodexCoder21Organization/HandoffWuiRemote stop attempt 15 for check run 123240615904 failed: foundation.url.protocol.sandbox.SandboxException: Sandboxed code threw an exception: java.lang.InternalError: Exception encountered in implementation of foundation/url/sjvm/intrinsics/ServiceBridge:rpc(Ljava/lang/String;Ljava/util/Map;)Ljava/util/Map; : foundation.url.resolver.UrlResolutionException: RPC request 'supersedeBuildRun' failed: RELAY_ERROR - Handler error: RPC error: INTERNAL_ERROR - Cannot supersede build run '048c9111': it is already in terminal status FAILED. Only in-progress builds can be superseded. cause: null. The cancellation stays saved; retrying in 1920000ms.this service
20m 58s ago deliveryCodexCoder21Organization/BuildTestEmbeddedGitHub delivered check_run.completed for CodexCoder21Organization/BuildTestEmbedded.codexcoder21
21m 10s ago deliveryCodexCoder21Organization/BuildTestEmbeddedGitHub delivered check_run.completed for CodexCoder21Organization/BuildTestEmbedded.codexcoder21
21m 15s ago build recovery failedCodexCoder21Organization/FiledropServiceServerFailed to recover shadow check 118986046332: foundation.url.protocol.sandbox.SandboxException: Sandboxed code threw an exception: java.lang.InternalError: Exception encountered in implementation of foundation/url/sjvm/intrinsics/ServiceBridge:rpc(Ljava/lang/String;Ljava/util/Map;)Ljava/util/Map; : foundation.url.resolver.UrlResolutionException: RPC request 'finalizeUpload' failed: INTERNAL_ERROR - RPC error: -1 - IllegalStateException: Cannot run CI operation 'finalizeUpload' because the url://buildtest/ connection has not been established, and it did not come up within 20000ms of waiting. Retry once the server logs 'url://buildtest/ connection established; ingestion and CI orchestration enabled.' cause: null at foundation.url.resolver.sandbox.TypeMarshaling.fromJvmResult$foundation_url_resolver_sandbox(TypeMarshaling.kt:692) at foundation.url.resolver.sandbox.InstanceMethodDispatcher$invokeWithActivity$3.invoke(SandboxedProxyGenerator.kt:2106) at foundation.url.resolver.sandbox.InstanceMethodDispatcher$invokeWithActivity$3.invoke(SandboxedProxyGenerator.kt:2037) at foundation.url.resolver.sandbox.SandboxedProxyGeneratorKt$invokeSandboxMethod$future$1$result$1.invoke(SandboxedProxyGenerator.kt:1491) at community.kotlin.clocks.hierarchical.RequiredClockPadKt.withRequiredClockPad(RequiredClockPad.kt:89) at foundation.url.resolver.sandbox.SandboxedProxyGeneratorKt.invokeSandboxMethod$lambda$4(SandboxedProxyGenerator.kt:1491) at java.base/java.util.concurrent.FutureTask.run(FutureTask.java:317) at foundation.url.resolver.sandbox.SandboxInvocationLane.runScheduled(SandboxedProxyGenerator.kt:1379) at foundation.url.resolver.sandbox.SandboxInvocationLane.schedule$lambda$5(SandboxedProxyGenerator.kt:1370) at java.base/java.util.concurrent.ThreadPoolExecutor.runWorker(ThreadPoolExecutor.java:1144) at java.base/java.util.concurrent.ThreadPoolExecutor$Worker.run(ThreadPoolExecutor.java:642) at java.base/java.lang.Thread.run(Thread.java:1583) Caused by: java.lang.RuntimeException: java.lang.InternalError: Exception encountered in implementation of foundation/url/sjvm/intrinsics/ServiceBridge:rpc(Ljava/lang/String;Ljava/util/Map;)Ljava/util/Map; : foundation.url.resolver.UrlResolutionException: RPC request 'finalizeUpload' failed: INTERNAL_ERROR - RPC error: -1 - IllegalStateException: Cannot run CI operation 'finalizeUpload' because the url://buildtest/ connection has not been established, and it did not come up within 20000ms of waiting. Retry once the server logs 'url://buildtest/ connection established; ingestion and CI orchestration enabled.' at foundation.url.resolver.sandbox.TypeMarshaling.fromJvmResult$foundation_url_resolver_sandbox(TypeMarshaling.kt:695) ... 11 more this service
21m 17s ago deliveryCodexCoder21Organization/BuildTestEmbeddedGitHub delivered check_run.completed for CodexCoder21Organization/BuildTestEmbedded.codexcoder21
21m 22s ago build remote stopCodexCoder21Organization/BuildTestProjectionJournalRemote stop attempt 158 for check run 120509268570 failed: foundation.url.protocol.sandbox.SandboxException: Sandboxed code threw an exception: java.lang.InternalError: Exception encountered in implementation of foundation/url/sjvm/intrinsics/ServiceBridge:rpc(Ljava/lang/String;Ljava/util/Map;)Ljava/util/Map; : foundation.url.resolver.UrlResolutionException: RPC request 'supersedeBuildRun' failed: RELAY_ERROR - Handler error: RPC error: INTERNAL_ERROR - Cannot supersede build run '77d8f7a6': it is already in terminal status FAILED. Only in-progress builds can be superseded. cause: null. The cancellation stays saved; retrying in 1920000ms.this service
21m 24s ago build remote stopCodexCoder21Organization/HandoffWuiRemote stop attempt 11 for check run 123244599322 failed: foundation.url.protocol.sandbox.SandboxException: Sandboxed code threw an exception: java.lang.InternalError: Exception encountered in implementation of foundation/url/sjvm/intrinsics/ServiceBridge:rpc(Ljava/lang/String;Ljava/util/Map;)Ljava/util/Map; : foundation.url.resolver.UrlResolutionException: RPC request 'supersedeBuildRun' failed: RELAY_ERROR - Handler error: RPC error: INTERNAL_ERROR - Cannot supersede build run '532f5b9c': it is already in terminal status FAILED. Only in-progress builds can be superseded. cause: null. The cancellation stays saved; retrying in 1920000ms.this service
21m 29s ago build remote stopCodexCoder21Organization/PerformanceTestServerServiceRemote stop attempt 10 for check run 123313394575 failed: foundation.url.protocol.sandbox.SandboxException: Sandboxed code threw an exception: java.lang.InternalError: Exception encountered in implementation of foundation/url/sjvm/intrinsics/ServiceBridge:rpc(Ljava/lang/String;Ljava/util/Map;)Ljava/util/Map; : foundation.url.resolver.UrlResolutionException: RPC request 'supersedeBuildRun' failed: RELAY_ERROR - Handler error: RPC error: INTERNAL_ERROR - Cannot supersede build run '9fec490a': it is already in terminal status COMPLETED. Only in-progress builds can be superseded. cause: null. The cancellation stays saved; retrying in 1920000ms.this service
21m 34s ago deliveryCodexCoder21Organization/BuildTestEmbeddedGitHub delivered check_run.completed for CodexCoder21Organization/BuildTestEmbedded.codexcoder21
21m 51s ago deliveryCodexCoder21Organization/BuildTestEmbeddedGitHub delivered check_run.completed for CodexCoder21Organization/BuildTestEmbedded.codexcoder21
22m 24s ago skippedCodexCoder21Organization/BuildTestEmbeddedThe non-PR branch 'wip/fix1738-p2-evidence' uses the wip/ checkpoint prefix, so this check_suite request started no build.this service
22m 24s ago deliveryCodexCoder21Organization/BuildTestEmbeddedGitHub delivered check_suite.requested for CodexCoder21Organization/BuildTestEmbedded.codexcoder21
22m 25s ago deliveryCodexCoder21Organization/BuildTestEmbeddedGitHub delivered push for CodexCoder21Organization/BuildTestEmbedded.codexcoder21
22m 29s ago build remote stopCodexCoder21Organization/AiCliHostSupervisorDaemonEmbeddedRemote stop attempt 10 for check run 123291765685 failed: foundation.url.protocol.sandbox.SandboxException: Sandboxed code threw an exception: java.lang.InternalError: Exception encountered in implementation of foundation/url/sjvm/intrinsics/ServiceBridge:rpc(Ljava/lang/String;Ljava/util/Map;)Ljava/util/Map; : foundation.url.resolver.UrlResolutionException: RPC request 'supersedeBuildRun' failed: RELAY_ERROR - Handler error: RPC error: INTERNAL_ERROR - Cannot supersede build run '8485074f': it is already in terminal status FAILED. Only in-progress builds can be superseded. cause: null. The cancellation stays saved; retrying in 1920000ms.this service
22m 29s ago build remote stopCodexCoder21Organization/HandoffEmbeddedRemote stop attempt 10 for check run 123355709083 failed: foundation.url.protocol.sandbox.SandboxException: Sandboxed code threw an exception: java.lang.InternalError: Exception encountered in implementation of foundation/url/sjvm/intrinsics/ServiceBridge:rpc(Ljava/lang/String;Ljava/util/Map;)Ljava/util/Map; : foundation.url.resolver.UrlResolutionException: RPC request 'supersedeBuildRun' failed: RELAY_ERROR - Handler error: RPC error: INTERNAL_ERROR - Cannot supersede build run 'de2f0a80': it is already in terminal status FAILED. Only in-progress builds can be superseded. cause: null. The cancellation stays saved; retrying in 1920000ms.this service
22m 40s ago deliveryCodexCoder21Organization/BuildTestProjectionJournalGitHub delivered check_run.completed for CodexCoder21Organization/BuildTestProjectionJournal.codexcoder21
22m 40s ago deliveryCodexCoder21Organization/BuildTestProjectionJournalGitHub delivered check_suite.completed for CodexCoder21Organization/BuildTestProjectionJournal.codexcoder21
23m 0s ago deliveryCodexCoder21Organization/BuildTestEmbeddedGitHub delivered check_run.completed for CodexCoder21Organization/BuildTestEmbedded.codexcoder21
23m 48s ago skippedCodexCoder21Organization/BuildTestEmbeddedThe non-PR branch 'wip/fix1738-p2-ckpt' uses the wip/ checkpoint prefix, so this check_suite request started no build.this service
23m 48s ago deliveryCodexCoder21Organization/BuildTestEmbeddedGitHub delivered check_suite.requested for CodexCoder21Organization/BuildTestEmbedded.codexcoder21
23m 50s ago deliveryCodexCoder21Organization/BuildTestEmbeddedGitHub delivered push for CodexCoder21Organization/BuildTestEmbedded.codexcoder21
23m 50s ago deliveryCodexCoder21Organization/BuildTestEmbeddedGitHub delivered check_run.completed for CodexCoder21Organization/BuildTestEmbedded.codexcoder21
24m 4s ago deliveryCodexCoder21Organization/BuildTestEmbeddedGitHub delivered check_run.completed for CodexCoder21Organization/BuildTestEmbedded.codexcoder21
24m 6s ago deliveryCodexCoder21Organization/BuildTestEmbeddedGitHub delivered check_run.completed for CodexCoder21Organization/BuildTestEmbedded.codexcoder21
24m 13s ago build remote stopCodexCoder21Organization/BuildTestProjectionJournalRemote stop attempt 23 for check run 122342779831 failed: foundation.url.protocol.sandbox.SandboxException: Sandboxed code threw an exception: java.lang.InternalError: Exception encountered in implementation of foundation/url/sjvm/intrinsics/ServiceBridge:rpc(Ljava/lang/String;Ljava/util/Map;)Ljava/util/Map; : foundation.url.resolver.UrlResolutionException: RPC request 'supersedeBuildRun' failed: RELAY_ERROR - Handler error: RPC error: INTERNAL_ERROR - Cannot supersede build run '36c72f65': it is already in terminal status FAILED. Only in-progress builds can be superseded. cause: null. The cancellation stays saved; retrying in 1920000ms.this service
24m 32s ago build remote stopCodexCoder21Organization/AiCliHostSupervisorDaemonEmbeddedRemote stop attempt 9 for check run 123300877367 failed: foundation.url.protocol.sandbox.SandboxException: Sandboxed code threw an exception: java.lang.InternalError: Exception encountered in implementation of foundation/url/sjvm/intrinsics/ServiceBridge:rpc(Ljava/lang/String;Ljava/util/Map;)Ljava/util/Map; : foundation.url.resolver.UrlResolutionException: RPC request 'supersedeBuildRun' failed: RELAY_ERROR - Handler error: RPC error: INTERNAL_ERROR - Cannot supersede build run 'c0c01ba1': it is already in terminal status FAILED. Only in-progress builds can be superseded. cause: null. The cancellation stays saved; retrying in 1920000ms.this service
24m 50s ago skippedCodexCoder21Organization/BuildTestProjectionJournalThe non-PR branch 'wip/journal-incomplete-baseline1-evidence' uses the wip/ checkpoint prefix, so this check_suite request started no build.this service
24m 50s ago deliveryCodexCoder21Organization/BuildTestProjectionJournalGitHub delivered check_suite.requested for CodexCoder21Organization/BuildTestProjectionJournal.codexcoder21
24m 51s ago deliveryCodexCoder21Organization/BuildTestProjectionJournalGitHub delivered push for CodexCoder21Organization/BuildTestProjectionJournal.codexcoder21
24m 53s ago skippedCodexCoder21Organization/BuildTestProjectionJournalThe non-PR branch 'wip/journal-incomplete-baseline1-main-ckpt' uses the wip/ checkpoint prefix, so this check_suite request started no build.this service
24m 53s ago deliveryCodexCoder21Organization/BuildTestProjectionJournalGitHub delivered check_suite.requested for CodexCoder21Organization/BuildTestProjectionJournal.codexcoder21
24m 54s ago deliveryCodexCoder21Organization/BuildTestProjectionJournalGitHub delivered push for CodexCoder21Organization/BuildTestProjectionJournal.codexcoder21
25m 15s ago build remote stopCodexCoder21Organization/HandoffWuiRemote stop attempt 18 for check run 123238164253 failed: foundation.url.protocol.sandbox.SandboxException: Sandboxed code threw an exception: java.lang.InternalError: Exception encountered in implementation of foundation/url/sjvm/intrinsics/ServiceBridge:rpc(Ljava/lang/String;Ljava/util/Map;)Ljava/util/Map; : foundation.url.resolver.UrlResolutionException: RPC request 'supersedeBuildRun' failed: RELAY_ERROR - Handler error: RPC error: INTERNAL_ERROR - Cannot supersede build run 'ec117f1b': it is already in terminal status FAILED. Only in-progress builds can be superseded. cause: null. The cancellation stays saved; retrying in 1920000ms.this service
25m 15s ago build remote stopCodexCoder21Organization/BuildTestProjectionJournalRemote stop attempt 9 for check run 124282946036 failed: foundation.url.protocol.sandbox.SandboxException: Sandboxed code threw an exception: java.lang.InternalError: Exception encountered in implementation of foundation/url/sjvm/intrinsics/ServiceBridge:rpc(Ljava/lang/String;Ljava/util/Map;)Ljava/util/Map; : foundation.url.resolver.UrlResolutionException: RPC request 'supersedeBuildRun' failed: RELAY_ERROR - Handler error: RPC error: INTERNAL_ERROR - Cannot supersede build run '58b8c6b0': it is already in terminal status CANCELED. Only in-progress builds can be superseded. cause: null. The cancellation stays saved; retrying in 1920000ms.this service
25m 26s ago deliveryCodexCoder21Organization/BuildTestProjectionJournalGitHub delivered check_run.completed for CodexCoder21Organization/BuildTestProjectionJournal.codexcoder21
25m 35s ago deliveryCodexCoder21Organization/BuildTestEmbeddedGitHub delivered check_suite.completed for CodexCoder21Organization/BuildTestEmbedded.codexcoder21