kotlin.build CI

Trigger log

Every delivery GitHub sent and what this service did with it — including the ones that produced no build. Newest first.

WhenWhatRepositoryDetailWho
10m 21s ago build remote stopCodexCoder21Organization/AiCliSupervisorManagerEmbeddedRemote stop attempt 45 for check run 123241570738 failed: foundation.url.protocol.sandbox.SandboxException: Sandboxed code threw an exception: java.lang.InternalError: Exception encountered in implementation of foundation/url/sjvm/intrinsics/ServiceBridge:rpc(Ljava/lang/String;Ljava/util/Map;)Ljava/util/Map; : foundation.url.resolver.UrlResolutionException: RPC request 'supersedeBuildRun' failed: INTERNAL_ERROR - RPC error: INTERNAL_ERROR - Cannot supersede build run 'c5e3d7e9': it is already in terminal status FAILED. Only in-progress builds can be superseded. cause: null. The cancellation stays saved; retrying in 1920000ms.this service
55m 19s ago build recovery failedCodexCoder21Organization/AiCliSupervisorManagerEmbeddedFailed to recover shadow check 122611529630: foundation.url.protocol.sandbox.SandboxException: Sandboxed code threw an exception: java.lang.InternalError: Exception encountered in implementation of foundation/url/sjvm/intrinsics/ServiceBridge:rpc(Ljava/lang/String;Ljava/util/Map;)Ljava/util/Map; : foundation.url.resolver.UrlResolutionException: RPC request 'finalizeUpload' failed: INTERNAL_ERROR - RPC error: -1 - CiUploadSessionNotFoundException: No CI upload session exists with id '83024939-b52e-48ff-bc0e-5fcc1715475d'. cause: null at foundation.url.resolver.sandbox.TypeMarshaling.fromJvmResult$foundation_url_resolver_sandbox(TypeMarshaling.kt:692) at foundation.url.resolver.sandbox.InstanceMethodDispatcher$invokeWithActivity$3.invoke(SandboxedProxyGenerator.kt:2106) at foundation.url.resolver.sandbox.InstanceMethodDispatcher$invokeWithActivity$3.invoke(SandboxedProxyGenerator.kt:2037) at foundation.url.resolver.sandbox.SandboxedProxyGeneratorKt$invokeSandboxMethod$future$1$result$1.invoke(SandboxedProxyGenerator.kt:1491) at community.kotlin.clocks.hierarchical.RequiredClockPadKt.withRequiredClockPad(RequiredClockPad.kt:89) at foundation.url.resolver.sandbox.SandboxedProxyGeneratorKt.invokeSandboxMethod$lambda$4(SandboxedProxyGenerator.kt:1491) at java.base/java.util.concurrent.FutureTask.run(FutureTask.java:317) at foundation.url.resolver.sandbox.SandboxInvocationLane.runScheduled(SandboxedProxyGenerator.kt:1379) at foundation.url.resolver.sandbox.SandboxInvocationLane.schedule$lambda$5(SandboxedProxyGenerator.kt:1370) at java.base/java.util.concurrent.ThreadPoolExecutor.runWorker(ThreadPoolExecutor.java:1144) at java.base/java.util.concurrent.ThreadPoolExecutor$Worker.run(ThreadPoolExecutor.java:642) at java.base/java.lang.Thread.run(Thread.java:1583) Caused by: java.lang.RuntimeException: java.lang.InternalError: Exception encountered in implementation of foundation/url/sjvm/intrinsics/ServiceBridge:rpc(Ljava/lang/String;Ljava/util/Map;)Ljava/util/Map; : foundation.url.resolver.UrlResolutionException: RPC request 'finalizeUpload' failed: INTERNAL_ERROR - RPC error: -1 - CiUploadSessionNotFoundException: No CI upload session exists with id '83024939-b52e-48ff-bc0e-5fcc1715475d'. at foundation.url.resolver.sandbox.TypeMarshaling.fromJvmResult$foundation_url_resolver_sandbox(TypeMarshaling.kt:695) ... 11 more this service
58m 37s ago build remote stopCodexCoder21Organization/AiCliSupervisorManagerEmbeddedRemote stop attempt 44 for check run 123241570738 failed: foundation.url.protocol.sandbox.SandboxException: Sandboxed code threw an exception: java.lang.InternalError: Exception encountered in implementation of foundation/url/sjvm/intrinsics/ServiceBridge:rpc(Ljava/lang/String;Ljava/util/Map;)Ljava/util/Map; : foundation.url.resolver.UrlResolutionException: RPC request 'supersedeBuildRun' failed: INTERNAL_ERROR - RPC error: INTERNAL_ERROR - Cannot supersede build run 'c5e3d7e9': it is already in terminal status FAILED. Only in-progress builds can be superseded. cause: null. The cancellation stays saved; retrying in 1920000ms.this service
1h 1m ago build recovery failedCodexCoder21Organization/AiCliSupervisorManagerEmbeddedFailed to recover shadow check 122573532696: foundation.url.protocol.sandbox.SandboxException: Sandboxed code threw an exception: java.lang.InternalError: Exception encountered in implementation of foundation/url/sjvm/intrinsics/ServiceBridge:rpc(Ljava/lang/String;Ljava/util/Map;)Ljava/util/Map; : foundation.url.resolver.UrlResolutionException: RPC request 'finalizeUpload' failed: INTERNAL_ERROR - RPC error: -1 - CiUploadSessionNotFoundException: No CI upload session exists with id 'e60ae069-c405-4b6b-a5c1-d7f2e048e5d4'. cause: null at foundation.url.resolver.sandbox.TypeMarshaling.fromJvmResult$foundation_url_resolver_sandbox(TypeMarshaling.kt:692) at foundation.url.resolver.sandbox.InstanceMethodDispatcher$invokeWithActivity$3.invoke(SandboxedProxyGenerator.kt:2106) at foundation.url.resolver.sandbox.InstanceMethodDispatcher$invokeWithActivity$3.invoke(SandboxedProxyGenerator.kt:2037) at foundation.url.resolver.sandbox.SandboxedProxyGeneratorKt$invokeSandboxMethod$future$1$result$1.invoke(SandboxedProxyGenerator.kt:1491) at community.kotlin.clocks.hierarchical.RequiredClockPadKt.withRequiredClockPad(RequiredClockPad.kt:89) at foundation.url.resolver.sandbox.SandboxedProxyGeneratorKt.invokeSandboxMethod$lambda$4(SandboxedProxyGenerator.kt:1491) at java.base/java.util.concurrent.FutureTask.run(FutureTask.java:317) at foundation.url.resolver.sandbox.SandboxInvocationLane.runScheduled(SandboxedProxyGenerator.kt:1379) at foundation.url.resolver.sandbox.SandboxInvocationLane.schedule$lambda$5(SandboxedProxyGenerator.kt:1370) at java.base/java.util.concurrent.ThreadPoolExecutor.runWorker(ThreadPoolExecutor.java:1144) at java.base/java.util.concurrent.ThreadPoolExecutor$Worker.run(ThreadPoolExecutor.java:642) at java.base/java.lang.Thread.run(Thread.java:1583) Caused by: java.lang.RuntimeException: java.lang.InternalError: Exception encountered in implementation of foundation/url/sjvm/intrinsics/ServiceBridge:rpc(Ljava/lang/String;Ljava/util/Map;)Ljava/util/Map; : foundation.url.resolver.UrlResolutionException: RPC request 'finalizeUpload' failed: INTERNAL_ERROR - RPC error: -1 - CiUploadSessionNotFoundException: No CI upload session exists with id 'e60ae069-c405-4b6b-a5c1-d7f2e048e5d4'. at foundation.url.resolver.sandbox.TypeMarshaling.fromJvmResult$foundation_url_resolver_sandbox(TypeMarshaling.kt:695) ... 11 more this service
1h 14m ago build recovery failedCodexCoder21Organization/AiCliSupervisorManagerEmbeddedFailed to recover shadow check 122538324485: foundation.url.protocol.sandbox.SandboxException: Sandboxed code threw an exception: java.lang.InternalError: Exception encountered in implementation of foundation/url/sjvm/intrinsics/ServiceBridge:rpc(Ljava/lang/String;Ljava/util/Map;)Ljava/util/Map; : foundation.url.resolver.UrlResolutionException: RPC request 'finalizeUpload' failed: INTERNAL_ERROR - RPC error: -1 - CiUploadSessionNotFoundException: No CI upload session exists with id 'c321be71-896e-4ee8-b05e-86b5e25c317a'. cause: null at foundation.url.resolver.sandbox.TypeMarshaling.fromJvmResult$foundation_url_resolver_sandbox(TypeMarshaling.kt:692) at foundation.url.resolver.sandbox.InstanceMethodDispatcher$invokeWithActivity$3.invoke(SandboxedProxyGenerator.kt:2106) at foundation.url.resolver.sandbox.InstanceMethodDispatcher$invokeWithActivity$3.invoke(SandboxedProxyGenerator.kt:2037) at foundation.url.resolver.sandbox.SandboxedProxyGeneratorKt$invokeSandboxMethod$future$1$result$1.invoke(SandboxedProxyGenerator.kt:1491) at community.kotlin.clocks.hierarchical.RequiredClockPadKt.withRequiredClockPad(RequiredClockPad.kt:89) at foundation.url.resolver.sandbox.SandboxedProxyGeneratorKt.invokeSandboxMethod$lambda$4(SandboxedProxyGenerator.kt:1491) at java.base/java.util.concurrent.FutureTask.run(FutureTask.java:317) at foundation.url.resolver.sandbox.SandboxInvocationLane.runScheduled(SandboxedProxyGenerator.kt:1379) at foundation.url.resolver.sandbox.SandboxInvocationLane.schedule$lambda$5(SandboxedProxyGenerator.kt:1370) at java.base/java.util.concurrent.ThreadPoolExecutor.runWorker(ThreadPoolExecutor.java:1144) at java.base/java.util.concurrent.ThreadPoolExecutor$Worker.run(ThreadPoolExecutor.java:642) at java.base/java.lang.Thread.run(Thread.java:1583) Caused by: java.lang.RuntimeException: java.lang.InternalError: Exception encountered in implementation of foundation/url/sjvm/intrinsics/ServiceBridge:rpc(Ljava/lang/String;Ljava/util/Map;)Ljava/util/Map; : foundation.url.resolver.UrlResolutionException: RPC request 'finalizeUpload' failed: INTERNAL_ERROR - RPC error: -1 - CiUploadSessionNotFoundException: No CI upload session exists with id 'c321be71-896e-4ee8-b05e-86b5e25c317a'. at foundation.url.resolver.sandbox.TypeMarshaling.fromJvmResult$foundation_url_resolver_sandbox(TypeMarshaling.kt:695) ... 11 more this service
1h 22m ago build recovery failedCodexCoder21Organization/AiCliSupervisorManagerEmbeddedFailed to recover shadow check 122531040482: foundation.url.protocol.sandbox.SandboxException: Sandboxed code threw an exception: java.lang.InternalError: Exception encountered in implementation of foundation/url/sjvm/intrinsics/ServiceBridge:rpc(Ljava/lang/String;Ljava/util/Map;)Ljava/util/Map; : foundation.url.resolver.UrlResolutionException: RPC request 'finalizeUpload' failed: INTERNAL_ERROR - RPC error: -1 - CiUploadSessionNotFoundException: No CI upload session exists with id '13c3e241-e906-4a86-a886-e25a6164543a'. cause: null at foundation.url.resolver.sandbox.TypeMarshaling.fromJvmResult$foundation_url_resolver_sandbox(TypeMarshaling.kt:692) at foundation.url.resolver.sandbox.InstanceMethodDispatcher$invokeWithActivity$3.invoke(SandboxedProxyGenerator.kt:2106) at foundation.url.resolver.sandbox.InstanceMethodDispatcher$invokeWithActivity$3.invoke(SandboxedProxyGenerator.kt:2037) at foundation.url.resolver.sandbox.SandboxedProxyGeneratorKt$invokeSandboxMethod$future$1$result$1.invoke(SandboxedProxyGenerator.kt:1491) at community.kotlin.clocks.hierarchical.RequiredClockPadKt.withRequiredClockPad(RequiredClockPad.kt:89) at foundation.url.resolver.sandbox.SandboxedProxyGeneratorKt.invokeSandboxMethod$lambda$4(SandboxedProxyGenerator.kt:1491) at java.base/java.util.concurrent.FutureTask.run(FutureTask.java:317) at foundation.url.resolver.sandbox.SandboxInvocationLane.runScheduled(SandboxedProxyGenerator.kt:1379) at foundation.url.resolver.sandbox.SandboxInvocationLane.schedule$lambda$5(SandboxedProxyGenerator.kt:1370) at java.base/java.util.concurrent.ThreadPoolExecutor.runWorker(ThreadPoolExecutor.java:1144) at java.base/java.util.concurrent.ThreadPoolExecutor$Worker.run(ThreadPoolExecutor.java:642) at java.base/java.lang.Thread.run(Thread.java:1583) Caused by: java.lang.RuntimeException: java.lang.InternalError: Exception encountered in implementation of foundation/url/sjvm/intrinsics/ServiceBridge:rpc(Ljava/lang/String;Ljava/util/Map;)Ljava/util/Map; : foundation.url.resolver.UrlResolutionException: RPC request 'finalizeUpload' failed: INTERNAL_ERROR - RPC error: -1 - CiUploadSessionNotFoundException: No CI upload session exists with id '13c3e241-e906-4a86-a886-e25a6164543a'. at foundation.url.resolver.sandbox.TypeMarshaling.fromJvmResult$foundation_url_resolver_sandbox(TypeMarshaling.kt:695) ... 11 more this service
1h 24m ago build recovery failedCodexCoder21Organization/AiCliSupervisorManagerEmbeddedFailed to recover shadow check 122529021604: foundation.url.protocol.sandbox.SandboxException: Sandboxed code threw an exception: java.lang.InternalError: Exception encountered in implementation of foundation/url/sjvm/intrinsics/ServiceBridge:rpc(Ljava/lang/String;Ljava/util/Map;)Ljava/util/Map; : foundation.url.resolver.UrlResolutionException: RPC request 'finalizeUpload' failed: INTERNAL_ERROR - RPC error: -1 - CiUploadSessionNotFoundException: No CI upload session exists with id 'acdbe035-4d96-4097-9a99-69105eda77f1'. cause: null at foundation.url.resolver.sandbox.TypeMarshaling.fromJvmResult$foundation_url_resolver_sandbox(TypeMarshaling.kt:692) at foundation.url.resolver.sandbox.InstanceMethodDispatcher$invokeWithActivity$3.invoke(SandboxedProxyGenerator.kt:2106) at foundation.url.resolver.sandbox.InstanceMethodDispatcher$invokeWithActivity$3.invoke(SandboxedProxyGenerator.kt:2037) at foundation.url.resolver.sandbox.SandboxedProxyGeneratorKt$invokeSandboxMethod$future$1$result$1.invoke(SandboxedProxyGenerator.kt:1491) at community.kotlin.clocks.hierarchical.RequiredClockPadKt.withRequiredClockPad(RequiredClockPad.kt:89) at foundation.url.resolver.sandbox.SandboxedProxyGeneratorKt.invokeSandboxMethod$lambda$4(SandboxedProxyGenerator.kt:1491) at java.base/java.util.concurrent.FutureTask.run(FutureTask.java:317) at foundation.url.resolver.sandbox.SandboxInvocationLane.runScheduled(SandboxedProxyGenerator.kt:1379) at foundation.url.resolver.sandbox.SandboxInvocationLane.schedule$lambda$5(SandboxedProxyGenerator.kt:1370) at java.base/java.util.concurrent.ThreadPoolExecutor.runWorker(ThreadPoolExecutor.java:1144) at java.base/java.util.concurrent.ThreadPoolExecutor$Worker.run(ThreadPoolExecutor.java:642) at java.base/java.lang.Thread.run(Thread.java:1583) Caused by: java.lang.RuntimeException: java.lang.InternalError: Exception encountered in implementation of foundation/url/sjvm/intrinsics/ServiceBridge:rpc(Ljava/lang/String;Ljava/util/Map;)Ljava/util/Map; : foundation.url.resolver.UrlResolutionException: RPC request 'finalizeUpload' failed: INTERNAL_ERROR - RPC error: -1 - CiUploadSessionNotFoundException: No CI upload session exists with id 'acdbe035-4d96-4097-9a99-69105eda77f1'. at foundation.url.resolver.sandbox.TypeMarshaling.fromJvmResult$foundation_url_resolver_sandbox(TypeMarshaling.kt:695) ... 11 more this service
1h 45m ago build remote stopCodexCoder21Organization/AiCliSupervisorManagerEmbeddedRemote stop attempt 43 for check run 123241570738 failed: foundation.url.protocol.sandbox.SandboxException: Sandboxed code threw an exception: java.lang.InternalError: Exception encountered in implementation of foundation/url/sjvm/intrinsics/ServiceBridge:rpc(Ljava/lang/String;Ljava/util/Map;)Ljava/util/Map; : foundation.url.resolver.UrlResolutionException: RPC request 'supersedeBuildRun' failed: INTERNAL_ERROR - RPC error: INTERNAL_ERROR - Cannot supersede build run 'c5e3d7e9': it is already in terminal status FAILED. Only in-progress builds can be superseded. cause: null. The cancellation stays saved; retrying in 1920000ms.this service
2h 20m ago deliveryCodexCoder21Organization/AiCliSupervisorManagerEmbeddedGitHub delivered check_suite.completed for CodexCoder21Organization/AiCliSupervisorManagerEmbedded.github-merge-queue[bot]
2h 20m ago deliveryCodexCoder21Organization/AiCliSupervisorManagerEmbeddedGitHub delivered check_run.completed for CodexCoder21Organization/AiCliSupervisorManagerEmbedded.github-merge-queue[bot]
2h 53m ago build remote stopCodexCoder21Organization/AiCliSupervisorManagerEmbeddedRemote stop attempt 42 for check run 123241570738 failed: foundation.url.protocol.sandbox.SandboxException: Sandboxed code threw an exception: java.lang.InternalError: Exception encountered in implementation of foundation/url/sjvm/intrinsics/ServiceBridge:rpc(Ljava/lang/String;Ljava/util/Map;)Ljava/util/Map; : foundation.url.resolver.UrlResolutionException: RPC request 'supersedeBuildRun' failed: INTERNAL_ERROR - RPC error: INTERNAL_ERROR - Cannot supersede build run 'c5e3d7e9': it is already in terminal status FAILED. Only in-progress builds can be superseded. cause: null. The cancellation stays saved; retrying in 1920000ms.this service
3h 11m ago build recovery failedCodexCoder21Organization/AiCliSupervisorManagerEmbeddedFailed to recover shadow check 119867225717: foundation.url.protocol.sandbox.SandboxException: Sandboxed code threw an exception: java.lang.InternalError: Exception encountered in implementation of foundation/url/sjvm/intrinsics/ServiceBridge:rpc(Ljava/lang/String;Ljava/util/Map;)Ljava/util/Map; : foundation.url.resolver.UrlResolutionException: RPC request 'finalizeUpload' failed: INTERNAL_ERROR - RPC error: -1 - CiUploadSessionNotFoundException: No CI upload session exists with id '73fbaded-fdf5-4c81-9754-8f58c5c93a87'. cause: null at foundation.url.resolver.sandbox.TypeMarshaling.fromJvmResult$foundation_url_resolver_sandbox(TypeMarshaling.kt:692) at foundation.url.resolver.sandbox.InstanceMethodDispatcher$invokeWithActivity$3.invoke(SandboxedProxyGenerator.kt:2106) at foundation.url.resolver.sandbox.InstanceMethodDispatcher$invokeWithActivity$3.invoke(SandboxedProxyGenerator.kt:2037) at foundation.url.resolver.sandbox.SandboxedProxyGeneratorKt$invokeSandboxMethod$future$1$result$1.invoke(SandboxedProxyGenerator.kt:1491) at community.kotlin.clocks.hierarchical.RequiredClockPadKt.withRequiredClockPad(RequiredClockPad.kt:89) at foundation.url.resolver.sandbox.SandboxedProxyGeneratorKt.invokeSandboxMethod$lambda$4(SandboxedProxyGenerator.kt:1491) at java.base/java.util.concurrent.FutureTask.run(FutureTask.java:317) at foundation.url.resolver.sandbox.SandboxInvocationLane.runScheduled(SandboxedProxyGenerator.kt:1379) at foundation.url.resolver.sandbox.SandboxInvocationLane.schedule$lambda$5(SandboxedProxyGenerator.kt:1370) at java.base/java.util.concurrent.ThreadPoolExecutor.runWorker(ThreadPoolExecutor.java:1144) at java.base/java.util.concurrent.ThreadPoolExecutor$Worker.run(ThreadPoolExecutor.java:642) at java.base/java.lang.Thread.run(Thread.java:1583) Caused by: java.lang.RuntimeException: java.lang.InternalError: Exception encountered in implementation of foundation/url/sjvm/intrinsics/ServiceBridge:rpc(Ljava/lang/String;Ljava/util/Map;)Ljava/util/Map; : foundation.url.resolver.UrlResolutionException: RPC request 'finalizeUpload' failed: INTERNAL_ERROR - RPC error: -1 - CiUploadSessionNotFoundException: No CI upload session exists with id '73fbaded-fdf5-4c81-9754-8f58c5c93a87'. at foundation.url.resolver.sandbox.TypeMarshaling.fromJvmResult$foundation_url_resolver_sandbox(TypeMarshaling.kt:695) ... 11 more this service
3h 19m ago build recovery failedCodexCoder21Organization/AiCliSupervisorManagerEmbeddedFailed to recover shadow check 119607018935: foundation.url.protocol.sandbox.SandboxException: Sandboxed code threw an exception: java.lang.InternalError: Exception encountered in implementation of foundation/url/sjvm/intrinsics/ServiceBridge:rpc(Ljava/lang/String;Ljava/util/Map;)Ljava/util/Map; : foundation.url.resolver.UrlResolutionException: RPC request 'finalizeUpload' failed: INTERNAL_ERROR - RPC error: -1 - CiUploadSessionNotFoundException: No CI upload session exists with id 'a13bde9e-33e9-41e4-9930-04d67f3fd493'. cause: null at foundation.url.resolver.sandbox.TypeMarshaling.fromJvmResult$foundation_url_resolver_sandbox(TypeMarshaling.kt:692) at foundation.url.resolver.sandbox.InstanceMethodDispatcher$invokeWithActivity$3.invoke(SandboxedProxyGenerator.kt:2106) at foundation.url.resolver.sandbox.InstanceMethodDispatcher$invokeWithActivity$3.invoke(SandboxedProxyGenerator.kt:2037) at foundation.url.resolver.sandbox.SandboxedProxyGeneratorKt$invokeSandboxMethod$future$1$result$1.invoke(SandboxedProxyGenerator.kt:1491) at community.kotlin.clocks.hierarchical.RequiredClockPadKt.withRequiredClockPad(RequiredClockPad.kt:89) at foundation.url.resolver.sandbox.SandboxedProxyGeneratorKt.invokeSandboxMethod$lambda$4(SandboxedProxyGenerator.kt:1491) at java.base/java.util.concurrent.FutureTask.run(FutureTask.java:317) at foundation.url.resolver.sandbox.SandboxInvocationLane.runScheduled(SandboxedProxyGenerator.kt:1379) at foundation.url.resolver.sandbox.SandboxInvocationLane.schedule$lambda$5(SandboxedProxyGenerator.kt:1370) at java.base/java.util.concurrent.ThreadPoolExecutor.runWorker(ThreadPoolExecutor.java:1144) at java.base/java.util.concurrent.ThreadPoolExecutor$Worker.run(ThreadPoolExecutor.java:642) at java.base/java.lang.Thread.run(Thread.java:1583) Caused by: java.lang.RuntimeException: java.lang.InternalError: Exception encountered in implementation of foundation/url/sjvm/intrinsics/ServiceBridge:rpc(Ljava/lang/String;Ljava/util/Map;)Ljava/util/Map; : foundation.url.resolver.UrlResolutionException: RPC request 'finalizeUpload' failed: INTERNAL_ERROR - RPC error: -1 - CiUploadSessionNotFoundException: No CI upload session exists with id 'a13bde9e-33e9-41e4-9930-04d67f3fd493'. at foundation.url.resolver.sandbox.TypeMarshaling.fromJvmResult$foundation_url_resolver_sandbox(TypeMarshaling.kt:695) ... 11 more this service
3h 20m ago build recovery failedCodexCoder21Organization/AiCliSupervisorManagerEmbeddedFailed to recover shadow check 119604916528: foundation.url.protocol.sandbox.SandboxException: Sandboxed code threw an exception: java.lang.InternalError: Exception encountered in implementation of foundation/url/sjvm/intrinsics/ServiceBridge:rpc(Ljava/lang/String;Ljava/util/Map;)Ljava/util/Map; : foundation.url.resolver.UrlResolutionException: RPC request 'finalizeUpload' failed: INTERNAL_ERROR - RPC error: -1 - CiUploadSessionNotFoundException: No CI upload session exists with id '8b1d3874-a667-41a5-8d40-3b0aa8ce2128'. cause: null at foundation.url.resolver.sandbox.TypeMarshaling.fromJvmResult$foundation_url_resolver_sandbox(TypeMarshaling.kt:692) at foundation.url.resolver.sandbox.InstanceMethodDispatcher$invokeWithActivity$3.invoke(SandboxedProxyGenerator.kt:2106) at foundation.url.resolver.sandbox.InstanceMethodDispatcher$invokeWithActivity$3.invoke(SandboxedProxyGenerator.kt:2037) at foundation.url.resolver.sandbox.SandboxedProxyGeneratorKt$invokeSandboxMethod$future$1$result$1.invoke(SandboxedProxyGenerator.kt:1491) at community.kotlin.clocks.hierarchical.RequiredClockPadKt.withRequiredClockPad(RequiredClockPad.kt:89) at foundation.url.resolver.sandbox.SandboxedProxyGeneratorKt.invokeSandboxMethod$lambda$4(SandboxedProxyGenerator.kt:1491) at java.base/java.util.concurrent.FutureTask.run(FutureTask.java:317) at foundation.url.resolver.sandbox.SandboxInvocationLane.runScheduled(SandboxedProxyGenerator.kt:1379) at foundation.url.resolver.sandbox.SandboxInvocationLane.schedule$lambda$5(SandboxedProxyGenerator.kt:1370) at java.base/java.util.concurrent.ThreadPoolExecutor.runWorker(ThreadPoolExecutor.java:1144) at java.base/java.util.concurrent.ThreadPoolExecutor$Worker.run(ThreadPoolExecutor.java:642) at java.base/java.lang.Thread.run(Thread.java:1583) Caused by: java.lang.RuntimeException: java.lang.InternalError: Exception encountered in implementation of foundation/url/sjvm/intrinsics/ServiceBridge:rpc(Ljava/lang/String;Ljava/util/Map;)Ljava/util/Map; : foundation.url.resolver.UrlResolutionException: RPC request 'finalizeUpload' failed: INTERNAL_ERROR - RPC error: -1 - CiUploadSessionNotFoundException: No CI upload session exists with id '8b1d3874-a667-41a5-8d40-3b0aa8ce2128'. at foundation.url.resolver.sandbox.TypeMarshaling.fromJvmResult$foundation_url_resolver_sandbox(TypeMarshaling.kt:695) ... 11 more this service
4h 3m ago build remote stopCodexCoder21Organization/AiCliSupervisorManagerEmbeddedRemote stop attempt 41 for check run 123241570738 failed: foundation.url.protocol.sandbox.SandboxException: Sandboxed code threw an exception: java.lang.InternalError: Exception encountered in implementation of foundation/url/sjvm/intrinsics/ServiceBridge:rpc(Ljava/lang/String;Ljava/util/Map;)Ljava/util/Map; : foundation.url.resolver.UrlResolutionException: RPC request 'supersedeBuildRun' failed: INTERNAL_ERROR - RPC error: INTERNAL_ERROR - Cannot supersede build run 'c5e3d7e9': it is already in terminal status FAILED. Only in-progress builds can be superseded. cause: null. The cancellation stays saved; retrying in 1920000ms.this service
4h 18m ago build recovery failedCodexCoder21Organization/AiCliSupervisorManagerEmbeddedFailed to recover shadow check 122573532696: foundation.url.protocol.sandbox.SandboxException: Sandboxed code threw an exception: java.lang.InternalError: Exception encountered in implementation of foundation/url/sjvm/intrinsics/ServiceBridge:rpc(Ljava/lang/String;Ljava/util/Map;)Ljava/util/Map; : foundation.url.resolver.UrlResolutionException: RPC request 'finalizeUpload' failed: RELAY_ERROR - Handler error: RPC error: -1 - CiUploadSessionNotFoundException: No CI upload session exists with id 'e60ae069-c405-4b6b-a5c1-d7f2e048e5d4'. cause: null at foundation.url.resolver.sandbox.TypeMarshaling.fromJvmResult$foundation_url_resolver_sandbox(TypeMarshaling.kt:692) at foundation.url.resolver.sandbox.InstanceMethodDispatcher$invokeWithActivity$3.invoke(SandboxedProxyGenerator.kt:2106) at foundation.url.resolver.sandbox.InstanceMethodDispatcher$invokeWithActivity$3.invoke(SandboxedProxyGenerator.kt:2037) at foundation.url.resolver.sandbox.SandboxedProxyGeneratorKt$invokeSandboxMethod$future$1$result$1.invoke(SandboxedProxyGenerator.kt:1491) at community.kotlin.clocks.hierarchical.RequiredClockPadKt.withRequiredClockPad(RequiredClockPad.kt:89) at foundation.url.resolver.sandbox.SandboxedProxyGeneratorKt.invokeSandboxMethod$lambda$4(SandboxedProxyGenerator.kt:1491) at java.base/java.util.concurrent.FutureTask.run(FutureTask.java:317) at foundation.url.resolver.sandbox.SandboxInvocationLane.runScheduled(SandboxedProxyGenerator.kt:1379) at foundation.url.resolver.sandbox.SandboxInvocationLane.schedule$lambda$5(SandboxedProxyGenerator.kt:1370) at java.base/java.util.concurrent.ThreadPoolExecutor.runWorker(ThreadPoolExecutor.java:1144) at java.base/java.util.concurrent.ThreadPoolExecutor$Worker.run(ThreadPoolExecutor.java:642) at java.base/java.lang.Thread.run(Thread.java:1583) Caused by: java.lang.RuntimeException: java.lang.InternalError: Exception encountered in implementation of foundation/url/sjvm/intrinsics/ServiceBridge:rpc(Ljava/lang/String;Ljava/util/Map;)Ljava/util/Map; : foundation.url.resolver.UrlResolutionException: RPC request 'finalizeUpload' failed: RELAY_ERROR - Handler error: RPC error: -1 - CiUploadSessionNotFoundException: No CI upload session exists with id 'e60ae069-c405-4b6b-a5c1-d7f2e048e5d4'. at foundation.url.resolver.sandbox.TypeMarshaling.fromJvmResult$foundation_url_resolver_sandbox(TypeMarshaling.kt:695) ... 11 more this service
4h 39m ago build recovery failedCodexCoder21Organization/AiCliSupervisorManagerEmbeddedFailed to recover shadow check 122538324485: foundation.url.protocol.sandbox.SandboxException: Sandboxed code threw an exception: java.lang.InternalError: Exception encountered in implementation of foundation/url/sjvm/intrinsics/ServiceBridge:rpc(Ljava/lang/String;Ljava/util/Map;)Ljava/util/Map; : foundation.url.resolver.UrlResolutionException: RPC request 'finalizeUpload' failed: RELAY_ERROR - Handler error: RPC error: -1 - CiUploadSessionNotFoundException: No CI upload session exists with id 'c321be71-896e-4ee8-b05e-86b5e25c317a'. cause: null at foundation.url.resolver.sandbox.TypeMarshaling.fromJvmResult$foundation_url_resolver_sandbox(TypeMarshaling.kt:692) at foundation.url.resolver.sandbox.InstanceMethodDispatcher$invokeWithActivity$3.invoke(SandboxedProxyGenerator.kt:2106) at foundation.url.resolver.sandbox.InstanceMethodDispatcher$invokeWithActivity$3.invoke(SandboxedProxyGenerator.kt:2037) at foundation.url.resolver.sandbox.SandboxedProxyGeneratorKt$invokeSandboxMethod$future$1$result$1.invoke(SandboxedProxyGenerator.kt:1491) at community.kotlin.clocks.hierarchical.RequiredClockPadKt.withRequiredClockPad(RequiredClockPad.kt:89) at foundation.url.resolver.sandbox.SandboxedProxyGeneratorKt.invokeSandboxMethod$lambda$4(SandboxedProxyGenerator.kt:1491) at java.base/java.util.concurrent.FutureTask.run(FutureTask.java:317) at foundation.url.resolver.sandbox.SandboxInvocationLane.runScheduled(SandboxedProxyGenerator.kt:1379) at foundation.url.resolver.sandbox.SandboxInvocationLane.schedule$lambda$5(SandboxedProxyGenerator.kt:1370) at java.base/java.util.concurrent.ThreadPoolExecutor.runWorker(ThreadPoolExecutor.java:1144) at java.base/java.util.concurrent.ThreadPoolExecutor$Worker.run(ThreadPoolExecutor.java:642) at java.base/java.lang.Thread.run(Thread.java:1583) Caused by: java.lang.RuntimeException: java.lang.InternalError: Exception encountered in implementation of foundation/url/sjvm/intrinsics/ServiceBridge:rpc(Ljava/lang/String;Ljava/util/Map;)Ljava/util/Map; : foundation.url.resolver.UrlResolutionException: RPC request 'finalizeUpload' failed: RELAY_ERROR - Handler error: RPC error: -1 - CiUploadSessionNotFoundException: No CI upload session exists with id 'c321be71-896e-4ee8-b05e-86b5e25c317a'. at foundation.url.resolver.sandbox.TypeMarshaling.fromJvmResult$foundation_url_resolver_sandbox(TypeMarshaling.kt:695) ... 11 more this service
4h 55m ago build recovery failedCodexCoder21Organization/AiCliSupervisorManagerEmbeddedFailed to recover shadow check 122532420298: foundation.url.protocol.sandbox.SandboxException: Sandboxed code threw an exception: java.lang.InternalError: Exception encountered in implementation of foundation/url/sjvm/intrinsics/ServiceBridge:rpc(Ljava/lang/String;Ljava/util/Map;)Ljava/util/Map; : foundation.url.resolver.UrlResolutionException: RPC request 'finalizeUpload' failed: RELAY_ERROR - Handler error: RPC error: -1 - CiUploadSessionNotFoundException: No CI upload session exists with id '1eb46ed3-94c3-41f8-9d06-be250db1645d'. cause: null at foundation.url.resolver.sandbox.TypeMarshaling.fromJvmResult$foundation_url_resolver_sandbox(TypeMarshaling.kt:692) at foundation.url.resolver.sandbox.InstanceMethodDispatcher$invokeWithActivity$3.invoke(SandboxedProxyGenerator.kt:2106) at foundation.url.resolver.sandbox.InstanceMethodDispatcher$invokeWithActivity$3.invoke(SandboxedProxyGenerator.kt:2037) at foundation.url.resolver.sandbox.SandboxedProxyGeneratorKt$invokeSandboxMethod$future$1$result$1.invoke(SandboxedProxyGenerator.kt:1491) at community.kotlin.clocks.hierarchical.RequiredClockPadKt.withRequiredClockPad(RequiredClockPad.kt:89) at foundation.url.resolver.sandbox.SandboxedProxyGeneratorKt.invokeSandboxMethod$lambda$4(SandboxedProxyGenerator.kt:1491) at java.base/java.util.concurrent.FutureTask.run(FutureTask.java:317) at foundation.url.resolver.sandbox.SandboxInvocationLane.runScheduled(SandboxedProxyGenerator.kt:1379) at foundation.url.resolver.sandbox.SandboxInvocationLane.schedule$lambda$5(SandboxedProxyGenerator.kt:1370) at java.base/java.util.concurrent.ThreadPoolExecutor.runWorker(ThreadPoolExecutor.java:1144) at java.base/java.util.concurrent.ThreadPoolExecutor$Worker.run(ThreadPoolExecutor.java:642) at java.base/java.lang.Thread.run(Thread.java:1583) Caused by: java.lang.RuntimeException: java.lang.InternalError: Exception encountered in implementation of foundation/url/sjvm/intrinsics/ServiceBridge:rpc(Ljava/lang/String;Ljava/util/Map;)Ljava/util/Map; : foundation.url.resolver.UrlResolutionException: RPC request 'finalizeUpload' failed: RELAY_ERROR - Handler error: RPC error: -1 - CiUploadSessionNotFoundException: No CI upload session exists with id '1eb46ed3-94c3-41f8-9d06-be250db1645d'. at foundation.url.resolver.sandbox.TypeMarshaling.fromJvmResult$foundation_url_resolver_sandbox(TypeMarshaling.kt:695) ... 11 more this service
4h 56m ago build remote stopCodexCoder21Organization/AiCliSupervisorManagerEmbeddedRemote stop attempt 40 for check run 123241570738 failed: foundation.url.protocol.sandbox.SandboxException: Sandboxed code threw an exception: java.lang.InternalError: Exception encountered in implementation of foundation/url/sjvm/intrinsics/ServiceBridge:rpc(Ljava/lang/String;Ljava/util/Map;)Ljava/util/Map; : foundation.url.resolver.UrlResolutionException: RPC request 'supersedeBuildRun' failed: INTERNAL_ERROR - RPC error: INTERNAL_ERROR - Cannot supersede build run 'c5e3d7e9': it is already in terminal status FAILED. Only in-progress builds can be superseded. cause: null. The cancellation stays saved; retrying in 1920000ms.this service
5h 13m ago deliveryCodexCoder21Organization/AiCliSupervisorManagerEmbeddedGitHub delivered check_suite.completed for CodexCoder21Organization/AiCliSupervisorManagerEmbedded.codexcoder21
5h 13m ago deliveryCodexCoder21Organization/AiCliSupervisorManagerEmbeddedGitHub delivered check_run.completed for CodexCoder21Organization/AiCliSupervisorManagerEmbedded.codexcoder21
5h 48m ago build remote stopCodexCoder21Organization/AiCliSupervisorManagerEmbeddedRemote stop attempt 39 for check run 123241570738 failed: foundation.url.protocol.sandbox.SandboxException: Sandboxed code threw an exception: java.lang.InternalError: Exception encountered in implementation of foundation/url/sjvm/intrinsics/ServiceBridge:rpc(Ljava/lang/String;Ljava/util/Map;)Ljava/util/Map; : foundation.url.resolver.UrlResolutionException: RPC request 'supersedeBuildRun' failed: INTERNAL_ERROR - RPC error: INTERNAL_ERROR - Cannot supersede build run 'c5e3d7e9': it is already in terminal status FAILED. Only in-progress builds can be superseded. cause: null. The cancellation stays saved; retrying in 1920000ms.this service
6h 46m ago build remote stopCodexCoder21Organization/AiCliSupervisorManagerEmbeddedRemote stop attempt 38 for check run 123241570738 failed: foundation.url.protocol.sandbox.SandboxException: Sandboxed code threw an exception: java.lang.InternalError: Exception encountered in implementation of foundation/url/sjvm/intrinsics/ServiceBridge:rpc(Ljava/lang/String;Ljava/util/Map;)Ljava/util/Map; : foundation.url.resolver.UrlResolutionException: RPC request 'supersedeBuildRun' failed: INTERNAL_ERROR - RPC error: INTERNAL_ERROR - Cannot supersede build run 'c5e3d7e9': it is already in terminal status FAILED. Only in-progress builds can be superseded. cause: null. The cancellation stays saved; retrying in 1920000ms.this service
7h 16m ago deliveryCodexCoder21Organization/AiCliSupervisorManagerEmbeddedGitHub delivered check_run.completed for CodexCoder21Organization/AiCliSupervisorManagerEmbedded.codexcoder21
7h 16m ago deliveryCodexCoder21Organization/AiCliSupervisorManagerEmbeddedGitHub delivered check_suite.completed for CodexCoder21Organization/AiCliSupervisorManagerEmbedded.codexcoder21
7h 18m ago deliveryCodexCoder21Organization/AiCliSupervisorManagerEmbeddedGitHub delivered check_suite.completed for CodexCoder21Organization/AiCliSupervisorManagerEmbedded.codexcoder21
7h 18m ago deliveryCodexCoder21Organization/AiCliSupervisorManagerEmbeddedGitHub delivered check_run.completed for CodexCoder21Organization/AiCliSupervisorManagerEmbedded.codexcoder21
7h 20m ago deliveryCodexCoder21Organization/AiCliSupervisorManagerEmbeddedGitHub delivered check_run.completed for CodexCoder21Organization/AiCliSupervisorManagerEmbedded.codexcoder21
7h 20m ago deliveryCodexCoder21Organization/AiCliSupervisorManagerEmbeddedGitHub delivered check_suite.completed for CodexCoder21Organization/AiCliSupervisorManagerEmbedded.codexcoder21
7h 20m ago deliveryCodexCoder21Organization/AiCliSupervisorManagerEmbeddedGitHub delivered check_suite.completed for CodexCoder21Organization/AiCliSupervisorManagerEmbedded.codexcoder21
7h 20m ago deliveryCodexCoder21Organization/AiCliSupervisorManagerEmbeddedGitHub delivered check_run.completed for CodexCoder21Organization/AiCliSupervisorManagerEmbedded.codexcoder21
7h 20m ago deliveryCodexCoder21Organization/AiCliSupervisorManagerEmbeddedGitHub delivered check_run.completed for CodexCoder21Organization/AiCliSupervisorManagerEmbedded.codexcoder21
7h 20m ago deliveryCodexCoder21Organization/AiCliSupervisorManagerEmbeddedGitHub delivered check_suite.completed for CodexCoder21Organization/AiCliSupervisorManagerEmbedded.codexcoder21
7h 20m ago deliveryCodexCoder21Organization/AiCliSupervisorManagerEmbeddedGitHub delivered check_run.completed for CodexCoder21Organization/AiCliSupervisorManagerEmbedded.codexcoder21
7h 20m ago deliveryCodexCoder21Organization/AiCliSupervisorManagerEmbeddedGitHub delivered check_suite.completed for CodexCoder21Organization/AiCliSupervisorManagerEmbedded.codexcoder21
7h 22m ago deliveryCodexCoder21Organization/AiCliSupervisorManagerEmbeddedGitHub delivered check_suite.completed for CodexCoder21Organization/AiCliSupervisorManagerEmbedded.codexcoder21
7h 22m ago deliveryCodexCoder21Organization/AiCliSupervisorManagerEmbeddedGitHub delivered check_run.completed for CodexCoder21Organization/AiCliSupervisorManagerEmbedded.codexcoder21
7h 24m ago deliveryCodexCoder21Organization/AiCliSupervisorManagerEmbeddedGitHub delivered check_run.completed for CodexCoder21Organization/AiCliSupervisorManagerEmbedded.codexcoder21
7h 24m ago deliveryCodexCoder21Organization/AiCliSupervisorManagerEmbeddedGitHub delivered check_suite.completed for CodexCoder21Organization/AiCliSupervisorManagerEmbedded.codexcoder21
7h 36m ago build remote stopCodexCoder21Organization/AiCliSupervisorManagerEmbeddedRemote stop attempt 37 for check run 123241570738 failed: foundation.url.protocol.sandbox.SandboxException: Sandboxed code threw an exception: java.lang.InternalError: Exception encountered in implementation of foundation/url/sjvm/intrinsics/ServiceBridge:rpc(Ljava/lang/String;Ljava/util/Map;)Ljava/util/Map; : foundation.url.resolver.UrlResolutionException: RPC request 'supersedeBuildRun' failed: INTERNAL_ERROR - RPC error: INTERNAL_ERROR - Cannot supersede build run 'c5e3d7e9': it is already in terminal status FAILED. Only in-progress builds can be superseded. cause: null. The cancellation stays saved; retrying in 1920000ms.this service
8h 35m ago build remote stopCodexCoder21Organization/AiCliSupervisorManagerEmbeddedRemote stop attempt 36 for check run 123241570738 failed: foundation.url.protocol.sandbox.SandboxException: Sandboxed code threw an exception: java.lang.InternalError: Exception encountered in implementation of foundation/url/sjvm/intrinsics/ServiceBridge:rpc(Ljava/lang/String;Ljava/util/Map;)Ljava/util/Map; : foundation.url.resolver.UrlResolutionException: RPC request 'supersedeBuildRun' failed: INTERNAL_ERROR - RPC error: INTERNAL_ERROR - BuildTest service is not ready for 'supersedeBuildRun': startup recovery is in phase RECOVERING_LOCAL_STATE (elapsedMs=2947474). No operation was performed. cause: null. The cancellation stays saved; retrying in 1920000ms.this service
9h 5m ago deliveryCodexCoder21Organization/AiCliSupervisorManagerEmbeddedGitHub delivered check_run.completed for CodexCoder21Organization/AiCliSupervisorManagerEmbedded.codexcoder21
9h 5m ago deliveryCodexCoder21Organization/AiCliSupervisorManagerEmbeddedGitHub delivered check_suite.completed for CodexCoder21Organization/AiCliSupervisorManagerEmbedded.codexcoder21
9h 6m ago deliveryCodexCoder21Organization/AiCliSupervisorManagerEmbeddedGitHub delivered check_run.completed for CodexCoder21Organization/AiCliSupervisorManagerEmbedded.codexcoder21
9h 6m ago deliveryCodexCoder21Organization/AiCliSupervisorManagerEmbeddedGitHub delivered check_suite.completed for CodexCoder21Organization/AiCliSupervisorManagerEmbedded.codexcoder21
9h 6m ago deliveryCodexCoder21Organization/AiCliSupervisorManagerEmbeddedGitHub delivered check_run.completed for CodexCoder21Organization/AiCliSupervisorManagerEmbedded.codexcoder21
9h 6m ago deliveryCodexCoder21Organization/AiCliSupervisorManagerEmbeddedGitHub delivered check_suite.completed for CodexCoder21Organization/AiCliSupervisorManagerEmbedded.codexcoder21
9h 10m ago build recovery failedCodexCoder21Organization/AiCliSupervisorManagerEmbeddedFailed to recover shadow check 121829805095: foundation.url.protocol.sandbox.SandboxException: Sandboxed code threw an exception: java.lang.InternalError: Exception encountered in implementation of foundation/url/sjvm/intrinsics/ServiceBridge:rpc(Ljava/lang/String;Ljava/util/Map;)Ljava/util/Map; : foundation.url.resolver.UrlResolutionException: RPC request 'finalizeUpload' failed: INTERNAL_ERROR - RPC error: -1 - CiUploadSessionNotFoundException: No CI upload session exists with id '93ddb3e5-f081-400f-b911-93ddee74fc2d'. cause: null at foundation.url.resolver.sandbox.TypeMarshaling.fromJvmResult$foundation_url_resolver_sandbox(TypeMarshaling.kt:692) at foundation.url.resolver.sandbox.InstanceMethodDispatcher$invokeWithActivity$3.invoke(SandboxedProxyGenerator.kt:2106) at foundation.url.resolver.sandbox.InstanceMethodDispatcher$invokeWithActivity$3.invoke(SandboxedProxyGenerator.kt:2037) at foundation.url.resolver.sandbox.SandboxedProxyGeneratorKt$invokeSandboxMethod$future$1$result$1.invoke(SandboxedProxyGenerator.kt:1491) at community.kotlin.clocks.hierarchical.RequiredClockPadKt.withRequiredClockPad(RequiredClockPad.kt:89) at foundation.url.resolver.sandbox.SandboxedProxyGeneratorKt.invokeSandboxMethod$lambda$4(SandboxedProxyGenerator.kt:1491) at java.base/java.util.concurrent.FutureTask.run(FutureTask.java:317) at foundation.url.resolver.sandbox.SandboxInvocationLane.runScheduled(SandboxedProxyGenerator.kt:1379) at foundation.url.resolver.sandbox.SandboxInvocationLane.schedule$lambda$5(SandboxedProxyGenerator.kt:1370) at java.base/java.util.concurrent.ThreadPoolExecutor.runWorker(ThreadPoolExecutor.java:1144) at java.base/java.util.concurrent.ThreadPoolExecutor$Worker.run(ThreadPoolExecutor.java:642) at java.base/java.lang.Thread.run(Thread.java:1583) Caused by: java.lang.RuntimeException: java.lang.InternalError: Exception encountered in implementation of foundation/url/sjvm/intrinsics/ServiceBridge:rpc(Ljava/lang/String;Ljava/util/Map;)Ljava/util/Map; : foundation.url.resolver.UrlResolutionException: RPC request 'finalizeUpload' failed: INTERNAL_ERROR - RPC error: -1 - CiUploadSessionNotFoundException: No CI upload session exists with id '93ddb3e5-f081-400f-b911-93ddee74fc2d'. at foundation.url.resolver.sandbox.TypeMarshaling.fromJvmResult$foundation_url_resolver_sandbox(TypeMarshaling.kt:695) ... 11 more this service
9h 11m ago build recovery failedCodexCoder21Organization/AiCliSupervisorManagerEmbeddedFailed to recover shadow check 121818962162: foundation.url.protocol.sandbox.SandboxException: Sandboxed code threw an exception: java.lang.InternalError: Exception encountered in implementation of foundation/url/sjvm/intrinsics/ServiceBridge:rpc(Ljava/lang/String;Ljava/util/Map;)Ljava/util/Map; : foundation.url.resolver.UrlResolutionException: RPC request 'finalizeUpload' failed: INTERNAL_ERROR - RPC error: -1 - CiUploadSessionNotFoundException: No CI upload session exists with id 'bd3b087a-c580-4b1c-b67d-0658e4483c7d'. cause: null at foundation.url.resolver.sandbox.TypeMarshaling.fromJvmResult$foundation_url_resolver_sandbox(TypeMarshaling.kt:692) at foundation.url.resolver.sandbox.InstanceMethodDispatcher$invokeWithActivity$3.invoke(SandboxedProxyGenerator.kt:2106) at foundation.url.resolver.sandbox.InstanceMethodDispatcher$invokeWithActivity$3.invoke(SandboxedProxyGenerator.kt:2037) at foundation.url.resolver.sandbox.SandboxedProxyGeneratorKt$invokeSandboxMethod$future$1$result$1.invoke(SandboxedProxyGenerator.kt:1491) at community.kotlin.clocks.hierarchical.RequiredClockPadKt.withRequiredClockPad(RequiredClockPad.kt:89) at foundation.url.resolver.sandbox.SandboxedProxyGeneratorKt.invokeSandboxMethod$lambda$4(SandboxedProxyGenerator.kt:1491) at java.base/java.util.concurrent.FutureTask.run(FutureTask.java:317) at foundation.url.resolver.sandbox.SandboxInvocationLane.runScheduled(SandboxedProxyGenerator.kt:1379) at foundation.url.resolver.sandbox.SandboxInvocationLane.schedule$lambda$5(SandboxedProxyGenerator.kt:1370) at java.base/java.util.concurrent.ThreadPoolExecutor.runWorker(ThreadPoolExecutor.java:1144) at java.base/java.util.concurrent.ThreadPoolExecutor$Worker.run(ThreadPoolExecutor.java:642) at java.base/java.lang.Thread.run(Thread.java:1583) Caused by: java.lang.RuntimeException: java.lang.InternalError: Exception encountered in implementation of foundation/url/sjvm/intrinsics/ServiceBridge:rpc(Ljava/lang/String;Ljava/util/Map;)Ljava/util/Map; : foundation.url.resolver.UrlResolutionException: RPC request 'finalizeUpload' failed: INTERNAL_ERROR - RPC error: -1 - CiUploadSessionNotFoundException: No CI upload session exists with id 'bd3b087a-c580-4b1c-b67d-0658e4483c7d'. at foundation.url.resolver.sandbox.TypeMarshaling.fromJvmResult$foundation_url_resolver_sandbox(TypeMarshaling.kt:695) ... 11 more this service
9h 14m ago build recovery failedCodexCoder21Organization/AiCliSupervisorManagerEmbeddedFailed to recover shadow check 121805257588: foundation.url.protocol.sandbox.SandboxException: Sandboxed code threw an exception: java.lang.InternalError: Exception encountered in implementation of foundation/url/sjvm/intrinsics/ServiceBridge:rpc(Ljava/lang/String;Ljava/util/Map;)Ljava/util/Map; : foundation.url.resolver.UrlResolutionException: RPC request 'finalizeUpload' failed: INTERNAL_ERROR - RPC error: -1 - CiUploadSessionNotFoundException: No CI upload session exists with id '675f9ddd-69a2-4989-8fe5-991a2eba7578'. cause: null at foundation.url.resolver.sandbox.TypeMarshaling.fromJvmResult$foundation_url_resolver_sandbox(TypeMarshaling.kt:692) at foundation.url.resolver.sandbox.InstanceMethodDispatcher$invokeWithActivity$3.invoke(SandboxedProxyGenerator.kt:2106) at foundation.url.resolver.sandbox.InstanceMethodDispatcher$invokeWithActivity$3.invoke(SandboxedProxyGenerator.kt:2037) at foundation.url.resolver.sandbox.SandboxedProxyGeneratorKt$invokeSandboxMethod$future$1$result$1.invoke(SandboxedProxyGenerator.kt:1491) at community.kotlin.clocks.hierarchical.RequiredClockPadKt.withRequiredClockPad(RequiredClockPad.kt:89) at foundation.url.resolver.sandbox.SandboxedProxyGeneratorKt.invokeSandboxMethod$lambda$4(SandboxedProxyGenerator.kt:1491) at java.base/java.util.concurrent.FutureTask.run(FutureTask.java:317) at foundation.url.resolver.sandbox.SandboxInvocationLane.runScheduled(SandboxedProxyGenerator.kt:1379) at foundation.url.resolver.sandbox.SandboxInvocationLane.schedule$lambda$5(SandboxedProxyGenerator.kt:1370) at java.base/java.util.concurrent.ThreadPoolExecutor.runWorker(ThreadPoolExecutor.java:1144) at java.base/java.util.concurrent.ThreadPoolExecutor$Worker.run(ThreadPoolExecutor.java:642) at java.base/java.lang.Thread.run(Thread.java:1583) Caused by: java.lang.RuntimeException: java.lang.InternalError: Exception encountered in implementation of foundation/url/sjvm/intrinsics/ServiceBridge:rpc(Ljava/lang/String;Ljava/util/Map;)Ljava/util/Map; : foundation.url.resolver.UrlResolutionException: RPC request 'finalizeUpload' failed: INTERNAL_ERROR - RPC error: -1 - CiUploadSessionNotFoundException: No CI upload session exists with id '675f9ddd-69a2-4989-8fe5-991a2eba7578'. at foundation.url.resolver.sandbox.TypeMarshaling.fromJvmResult$foundation_url_resolver_sandbox(TypeMarshaling.kt:695) ... 11 more this service
9h 31m ago build remote stopCodexCoder21Organization/AiCliSupervisorManagerEmbeddedRemote stop attempt 35 for check run 123241570738 failed: foundation.url.protocol.sandbox.SandboxException: Sandboxed code threw an exception: java.lang.InternalError: Exception encountered in implementation of foundation/url/sjvm/intrinsics/ServiceBridge:rpc(Ljava/lang/String;Ljava/util/Map;)Ljava/util/Map; : foundation.url.resolver.UrlResolutionException: RPC request 'supersedeBuildRun' failed: INTERNAL_ERROR - RPC error: INTERNAL_ERROR - Cannot supersede build run 'c5e3d7e9': it is already in terminal status FAILED. Only in-progress builds can be superseded. cause: null. The cancellation stays saved; retrying in 1920000ms.this service
10h 20m ago build remote stopCodexCoder21Organization/AiCliSupervisorManagerEmbeddedRemote stop attempt 34 for check run 123241570738 failed: foundation.url.protocol.sandbox.SandboxException: Sandboxed code threw an exception: java.lang.InternalError: Exception encountered in implementation of foundation/url/sjvm/intrinsics/ServiceBridge:rpc(Ljava/lang/String;Ljava/util/Map;)Ljava/util/Map; : foundation.url.resolver.UrlResolutionException: RPC request 'supersedeBuildRun' failed: INTERNAL_ERROR - RPC error: INTERNAL_ERROR - Cannot supersede build run 'c5e3d7e9': it is already in terminal status FAILED. Only in-progress builds can be superseded. cause: null. The cancellation stays saved; retrying in 1920000ms.this service
11h 6m ago build remote stopCodexCoder21Organization/AiCliSupervisorManagerEmbeddedRemote stop attempt 33 for check run 123241570738 failed: foundation.url.protocol.sandbox.SandboxException: Sandboxed code threw an exception: java.lang.InternalError: Exception encountered in implementation of foundation/url/sjvm/intrinsics/ServiceBridge:rpc(Ljava/lang/String;Ljava/util/Map;)Ljava/util/Map; : foundation.url.resolver.UrlResolutionException: RPC request 'supersedeBuildRun' failed: INTERNAL_ERROR - RPC error: INTERNAL_ERROR - Cannot supersede build run 'c5e3d7e9': it is already in terminal status FAILED. Only in-progress builds can be superseded. cause: null. The cancellation stays saved; retrying in 1920000ms.this service
12h 10m ago build remote stopCodexCoder21Organization/AiCliSupervisorManagerEmbeddedRemote stop attempt 32 for check run 123241570738 failed: foundation.url.protocol.sandbox.SandboxException: Sandboxed code threw an exception: java.lang.InternalError: Exception encountered in implementation of foundation/url/sjvm/intrinsics/ServiceBridge:rpc(Ljava/lang/String;Ljava/util/Map;)Ljava/util/Map; : foundation.url.resolver.UrlResolutionException: RPC request 'supersedeBuildRun' failed: INTERNAL_ERROR - RPC error: INTERNAL_ERROR - Cannot supersede build run 'c5e3d7e9': it is already in terminal status FAILED. Only in-progress builds can be superseded. cause: null. The cancellation stays saved; retrying in 1920000ms.this service
12h 58m ago build remote stopCodexCoder21Organization/AiCliSupervisorManagerEmbeddedRemote stop attempt 31 for check run 123241570738 failed: foundation.url.protocol.sandbox.SandboxException: Sandboxed code threw an exception: java.lang.InternalError: Exception encountered in implementation of foundation/url/sjvm/intrinsics/ServiceBridge:rpc(Ljava/lang/String;Ljava/util/Map;)Ljava/util/Map; : foundation.url.resolver.UrlResolutionException: RPC request 'supersedeBuildRun' failed: INTERNAL_ERROR - RPC error: INTERNAL_ERROR - Cannot supersede build run 'c5e3d7e9': it is already in terminal status FAILED. Only in-progress builds can be superseded. cause: null. The cancellation stays saved; retrying in 1920000ms.this service
13h 49m ago build recovery failedCodexCoder21Organization/AiCliSupervisorManagerEmbeddedFailed to recover shadow check 119867225717: foundation.url.protocol.sandbox.SandboxException: Sandboxed code threw an exception: java.lang.InternalError: Exception encountered in implementation of foundation/url/sjvm/intrinsics/ServiceBridge:rpc(Ljava/lang/String;Ljava/util/Map;)Ljava/util/Map; : foundation.url.resolver.UrlResolutionException: RPC request 'finalizeUpload' failed: INTERNAL_ERROR - RPC error: -1 - IllegalStateException: Cannot run CI operation 'finalizeUpload' because the url://buildtest/ connection has not been established, and it did not come up within 20000ms of waiting. Retry once the server logs 'url://buildtest/ connection established; ingestion and CI orchestration enabled.' cause: null at foundation.url.resolver.sandbox.TypeMarshaling.fromJvmResult$foundation_url_resolver_sandbox(TypeMarshaling.kt:692) at foundation.url.resolver.sandbox.InstanceMethodDispatcher$invokeWithActivity$3.invoke(SandboxedProxyGenerator.kt:2106) at foundation.url.resolver.sandbox.InstanceMethodDispatcher$invokeWithActivity$3.invoke(SandboxedProxyGenerator.kt:2037) at foundation.url.resolver.sandbox.SandboxedProxyGeneratorKt$invokeSandboxMethod$future$1$result$1.invoke(SandboxedProxyGenerator.kt:1491) at community.kotlin.clocks.hierarchical.RequiredClockPadKt.withRequiredClockPad(RequiredClockPad.kt:89) at foundation.url.resolver.sandbox.SandboxedProxyGeneratorKt.invokeSandboxMethod$lambda$4(SandboxedProxyGenerator.kt:1491) at java.base/java.util.concurrent.FutureTask.run(FutureTask.java:317) at foundation.url.resolver.sandbox.SandboxInvocationLane.runScheduled(SandboxedProxyGenerator.kt:1379) at foundation.url.resolver.sandbox.SandboxInvocationLane.schedule$lambda$5(SandboxedProxyGenerator.kt:1370) at java.base/java.util.concurrent.ThreadPoolExecutor.runWorker(ThreadPoolExecutor.java:1144) at java.base/java.util.concurrent.ThreadPoolExecutor$Worker.run(ThreadPoolExecutor.java:642) at java.base/java.lang.Thread.run(Thread.java:1583) Caused by: java.lang.RuntimeException: java.lang.InternalError: Exception encountered in implementation of foundation/url/sjvm/intrinsics/ServiceBridge:rpc(Ljava/lang/String;Ljava/util/Map;)Ljava/util/Map; : foundation.url.resolver.UrlResolutionException: RPC request 'finalizeUpload' failed: INTERNAL_ERROR - RPC error: -1 - IllegalStateException: Cannot run CI operation 'finalizeUpload' because the url://buildtest/ connection has not been established, and it did not come up within 20000ms of waiting. Retry once the server logs 'url://buildtest/ connection established; ingestion and CI orchestration enabled.' at foundation.url.resolver.sandbox.TypeMarshaling.fromJvmResult$foundation_url_resolver_sandbox(TypeMarshaling.kt:695) ... 11 more this service
13h 51m ago build remote stopCodexCoder21Organization/AiCliSupervisorManagerEmbeddedRemote stop attempt 30 for check run 123241570738 failed: foundation.url.protocol.sandbox.SandboxException: Sandboxed code threw an exception: java.lang.InternalError: Exception encountered in implementation of foundation/url/sjvm/intrinsics/ServiceBridge:rpc(Ljava/lang/String;Ljava/util/Map;)Ljava/util/Map; : foundation.url.resolver.UrlResolutionException: RPC request 'supersedeBuildRun' failed: INTERNAL_ERROR - RPC error: INTERNAL_ERROR - Cannot supersede build run 'c5e3d7e9': it is already in terminal status FAILED. Only in-progress builds can be superseded. cause: null. The cancellation stays saved; retrying in 1920000ms.this service
14h 39m ago build remote stopCodexCoder21Organization/AiCliSupervisorManagerEmbeddedRemote stop attempt 29 for check run 123241570738 failed: foundation.url.protocol.sandbox.SandboxException: Sandboxed code threw an exception: java.lang.InternalError: Exception encountered in implementation of foundation/url/sjvm/intrinsics/ServiceBridge:rpc(Ljava/lang/String;Ljava/util/Map;)Ljava/util/Map; : foundation.url.resolver.UrlResolutionException: RPC request 'supersedeBuildRun' failed: INTERNAL_ERROR - RPC error: INTERNAL_ERROR - Cannot supersede build run 'c5e3d7e9': it is already in terminal status FAILED. Only in-progress builds can be superseded. cause: null. The cancellation stays saved; retrying in 1920000ms.this service
15h 25m ago build remote stopCodexCoder21Organization/AiCliSupervisorManagerEmbeddedRemote stop attempt 28 for check run 123241570738 failed: foundation.url.protocol.sandbox.SandboxException: Sandboxed code threw an exception: java.lang.InternalError: Exception encountered in implementation of foundation/url/sjvm/intrinsics/ServiceBridge:rpc(Ljava/lang/String;Ljava/util/Map;)Ljava/util/Map; : foundation.url.resolver.UrlResolutionException: RPC request 'supersedeBuildRun' failed: INTERNAL_ERROR - RPC error: INTERNAL_ERROR - Cannot supersede build run 'c5e3d7e9': it is already in terminal status FAILED. Only in-progress builds can be superseded. cause: null. The cancellation stays saved; retrying in 1920000ms.this service
16h 10m ago build remote stopCodexCoder21Organization/AiCliSupervisorManagerEmbeddedRemote stop attempt 27 for check run 123241570738 failed: foundation.url.protocol.sandbox.SandboxException: Sandboxed code threw an exception: java.lang.InternalError: Exception encountered in implementation of foundation/url/sjvm/intrinsics/ServiceBridge:rpc(Ljava/lang/String;Ljava/util/Map;)Ljava/util/Map; : foundation.url.resolver.UrlResolutionException: RPC request 'supersedeBuildRun' failed: INTERNAL_ERROR - RPC error: INTERNAL_ERROR - Cannot supersede build run 'c5e3d7e9': it is already in terminal status FAILED. Only in-progress builds can be superseded. cause: null. The cancellation stays saved; retrying in 1920000ms.this service
16h 58m ago build remote stopCodexCoder21Organization/AiCliSupervisorManagerEmbeddedRemote stop attempt 26 for check run 123241570738 failed: foundation.url.protocol.sandbox.SandboxException: Sandboxed code threw an exception: java.lang.InternalError: Exception encountered in implementation of foundation/url/sjvm/intrinsics/ServiceBridge:rpc(Ljava/lang/String;Ljava/util/Map;)Ljava/util/Map; : foundation.url.resolver.UrlResolutionException: RPC request 'supersedeBuildRun' failed: INTERNAL_ERROR - RPC error: INTERNAL_ERROR - Cannot supersede build run 'c5e3d7e9': it is already in terminal status FAILED. Only in-progress builds can be superseded. cause: null. The cancellation stays saved; retrying in 1920000ms.this service
17h 47m ago build remote stopCodexCoder21Organization/AiCliSupervisorManagerEmbeddedRemote stop attempt 25 for check run 123241570738 failed: foundation.url.protocol.sandbox.SandboxException: Sandboxed code threw an exception: java.lang.InternalError: Exception encountered in implementation of foundation/url/sjvm/intrinsics/ServiceBridge:rpc(Ljava/lang/String;Ljava/util/Map;)Ljava/util/Map; : foundation.url.resolver.UrlResolutionException: RPC request 'supersedeBuildRun' failed: INTERNAL_ERROR - RPC error: INTERNAL_ERROR - Cannot supersede build run 'c5e3d7e9': it is already in terminal status FAILED. Only in-progress builds can be superseded. cause: null. The cancellation stays saved; retrying in 1920000ms.this service
18h 40m ago build remote stopCodexCoder21Organization/AiCliSupervisorManagerEmbeddedRemote stop attempt 24 for check run 123241570738 failed: foundation.url.protocol.sandbox.SandboxException: Sandboxed code threw an exception: java.lang.InternalError: Exception encountered in implementation of foundation/url/sjvm/intrinsics/ServiceBridge:rpc(Ljava/lang/String;Ljava/util/Map;)Ljava/util/Map; : foundation.url.resolver.UrlResolutionException: RPC request 'supersedeBuildRun' failed: INTERNAL_ERROR - RPC error: INTERNAL_ERROR - Cannot supersede build run 'c5e3d7e9': it is already in terminal status FAILED. Only in-progress builds can be superseded. cause: null. The cancellation stays saved; retrying in 1920000ms.this service
19h 42m ago build remote stopCodexCoder21Organization/AiCliSupervisorManagerEmbeddedRemote stop attempt 23 for check run 123241570738 failed: foundation.url.protocol.sandbox.SandboxException: Sandboxed code threw an exception: java.lang.InternalError: Exception encountered in implementation of foundation/url/sjvm/intrinsics/ServiceBridge:rpc(Ljava/lang/String;Ljava/util/Map;)Ljava/util/Map; : foundation.url.resolver.UrlResolutionException: RPC request 'supersedeBuildRun' failed: INTERNAL_ERROR - RPC error: INTERNAL_ERROR - Cannot supersede build run 'c5e3d7e9': it is already in terminal status FAILED. Only in-progress builds can be superseded. cause: null. The cancellation stays saved; retrying in 1920000ms.this service
20h 27m ago build remote stopCodexCoder21Organization/AiCliSupervisorManagerEmbeddedRemote stop attempt 22 for check run 123241570738 failed: foundation.url.protocol.sandbox.SandboxException: Sandboxed code threw an exception: java.lang.InternalError: Exception encountered in implementation of foundation/url/sjvm/intrinsics/ServiceBridge:rpc(Ljava/lang/String;Ljava/util/Map;)Ljava/util/Map; : foundation.url.resolver.UrlResolutionException: RPC request 'supersedeBuildRun' failed: INTERNAL_ERROR - RPC error: INTERNAL_ERROR - Cannot supersede build run 'c5e3d7e9': it is already in terminal status FAILED. Only in-progress builds can be superseded. cause: null. The cancellation stays saved; retrying in 1920000ms.this service
21h 16m ago build remote stopCodexCoder21Organization/AiCliSupervisorManagerEmbeddedRemote stop attempt 21 for check run 123241570738 failed: foundation.url.protocol.sandbox.SandboxException: Sandboxed code threw an exception: java.lang.InternalError: Exception encountered in implementation of foundation/url/sjvm/intrinsics/ServiceBridge:rpc(Ljava/lang/String;Ljava/util/Map;)Ljava/util/Map; : foundation.url.resolver.UrlResolutionException: RPC request 'supersedeBuildRun' failed: INTERNAL_ERROR - RPC error: INTERNAL_ERROR - Cannot supersede build run 'c5e3d7e9': it is already in terminal status FAILED. Only in-progress builds can be superseded. cause: null. The cancellation stays saved; retrying in 1920000ms.this service
22h 1m ago build remote stopCodexCoder21Organization/AiCliSupervisorManagerEmbeddedRemote stop attempt 20 for check run 123241570738 failed: foundation.url.protocol.sandbox.SandboxException: Sandboxed code threw an exception: java.lang.InternalError: Exception encountered in implementation of foundation/url/sjvm/intrinsics/ServiceBridge:rpc(Ljava/lang/String;Ljava/util/Map;)Ljava/util/Map; : foundation.url.resolver.UrlResolutionException: RPC request 'supersedeBuildRun' failed: INTERNAL_ERROR - RPC error: INTERNAL_ERROR - Cannot supersede build run 'c5e3d7e9': it is already in terminal status FAILED. Only in-progress builds can be superseded. cause: null. The cancellation stays saved; retrying in 1920000ms.this service
22h 49m ago build remote stopCodexCoder21Organization/AiCliSupervisorManagerEmbeddedRemote stop attempt 19 for check run 123241570738 failed: foundation.url.protocol.sandbox.SandboxException: Sandboxed code threw an exception: java.lang.InternalError: Exception encountered in implementation of foundation/url/sjvm/intrinsics/ServiceBridge:rpc(Ljava/lang/String;Ljava/util/Map;)Ljava/util/Map; : foundation.url.resolver.UrlResolutionException: RPC request 'supersedeBuildRun' failed: INTERNAL_ERROR - RPC error: INTERNAL_ERROR - Cannot supersede build run 'c5e3d7e9': it is already in terminal status FAILED. Only in-progress builds can be superseded. cause: null. The cancellation stays saved; retrying in 1920000ms.this service
23h 34m ago build remote stopCodexCoder21Organization/AiCliSupervisorManagerEmbeddedRemote stop attempt 18 for check run 123241570738 failed: foundation.url.protocol.sandbox.SandboxException: Sandboxed code threw an exception: java.lang.InternalError: Exception encountered in implementation of foundation/url/sjvm/intrinsics/ServiceBridge:rpc(Ljava/lang/String;Ljava/util/Map;)Ljava/util/Map; : foundation.url.resolver.UrlResolutionException: RPC request 'supersedeBuildRun' failed: INTERNAL_ERROR - RPC error: INTERNAL_ERROR - Cannot supersede build run 'c5e3d7e9': it is already in terminal status FAILED. Only in-progress builds can be superseded. cause: null. The cancellation stays saved; retrying in 1920000ms.this service
1d 0h ago build remote stopCodexCoder21Organization/AiCliSupervisorManagerEmbeddedRemote stop attempt 17 for check run 123241570738 failed: foundation.url.protocol.sandbox.SandboxException: Sandboxed code threw an exception: java.lang.InternalError: Exception encountered in implementation of foundation/url/sjvm/intrinsics/ServiceBridge:rpc(Ljava/lang/String;Ljava/util/Map;)Ljava/util/Map; : foundation.url.resolver.UrlResolutionException: RPC request 'supersedeBuildRun' failed: INTERNAL_ERROR - RPC error: INTERNAL_ERROR - Cannot supersede build run 'c5e3d7e9': it is already in terminal status FAILED. Only in-progress builds can be superseded. cause: null. The cancellation stays saved; retrying in 1920000ms.this service
1d 1h ago build remote stopCodexCoder21Organization/AiCliSupervisorManagerEmbeddedRemote stop attempt 16 for check run 123241570738 failed: foundation.url.protocol.sandbox.SandboxException: Sandboxed code threw an exception: java.lang.InternalError: Exception encountered in implementation of foundation/url/sjvm/intrinsics/ServiceBridge:rpc(Ljava/lang/String;Ljava/util/Map;)Ljava/util/Map; : foundation.url.resolver.UrlResolutionException: RPC request 'supersedeBuildRun' failed: INTERNAL_ERROR - RPC error: INTERNAL_ERROR - Cannot supersede build run 'c5e3d7e9': it is already in terminal status FAILED. Only in-progress builds can be superseded. cause: null. The cancellation stays saved; retrying in 1920000ms.this service
1d 1h ago build remote stopCodexCoder21Organization/AiCliSupervisorManagerEmbeddedRemote stop attempt 15 for check run 123241570738 failed: foundation.url.protocol.sandbox.SandboxException: Sandboxed code threw an exception: java.lang.InternalError: Exception encountered in implementation of foundation/url/sjvm/intrinsics/ServiceBridge:rpc(Ljava/lang/String;Ljava/util/Map;)Ljava/util/Map; : foundation.url.resolver.UrlResolutionException: RPC request 'supersedeBuildRun' failed: INTERNAL_ERROR - RPC error: INTERNAL_ERROR - Cannot supersede build run 'c5e3d7e9': it is already in terminal status FAILED. Only in-progress builds can be superseded. cause: null. The cancellation stays saved; retrying in 1920000ms.this service
1d 2h ago build remote stopCodexCoder21Organization/AiCliSupervisorManagerEmbeddedRemote stop attempt 14 for check run 123241570738 failed: foundation.url.protocol.sandbox.SandboxException: Sandboxed code threw an exception: java.lang.InternalError: Exception encountered in implementation of foundation/url/sjvm/intrinsics/ServiceBridge:rpc(Ljava/lang/String;Ljava/util/Map;)Ljava/util/Map; : foundation.url.resolver.UrlResolutionException: RPC request 'supersedeBuildRun' failed: RELAY_ERROR - Handler error: RPC error: INTERNAL_ERROR - Cannot supersede build run 'c5e3d7e9': it is already in terminal status FAILED. Only in-progress builds can be superseded. cause: null. The cancellation stays saved; retrying in 1920000ms.this service
1d 3h ago build remote stopCodexCoder21Organization/AiCliSupervisorManagerEmbeddedRemote stop attempt 13 for check run 123241570738 failed: foundation.url.protocol.sandbox.SandboxException: Sandboxed code threw an exception: java.lang.InternalError: Exception encountered in implementation of foundation/url/sjvm/intrinsics/ServiceBridge:rpc(Ljava/lang/String;Ljava/util/Map;)Ljava/util/Map; : foundation.url.resolver.UrlResolutionException: RPC request 'supersedeBuildRun' failed: RELAY_ERROR - Handler error: RPC error: INTERNAL_ERROR - Cannot supersede build run 'c5e3d7e9': it is already in terminal status FAILED. Only in-progress builds can be superseded. cause: null. The cancellation stays saved; retrying in 1920000ms.this service
1d 4h ago build remote stopCodexCoder21Organization/AiCliSupervisorManagerEmbeddedRemote stop attempt 12 for check run 123241570738 failed: foundation.url.protocol.sandbox.SandboxException: Sandboxed code threw an exception: java.lang.InternalError: Exception encountered in implementation of foundation/url/sjvm/intrinsics/ServiceBridge:rpc(Ljava/lang/String;Ljava/util/Map;)Ljava/util/Map; : foundation.url.resolver.UrlResolutionException: RPC request 'supersedeBuildRun' failed: RELAY_ERROR - Handler error: RPC error: INTERNAL_ERROR - Cannot supersede build run 'c5e3d7e9': it is already in terminal status FAILED. Only in-progress builds can be superseded. cause: null. The cancellation stays saved; retrying in 1920000ms.this service
1d 4h ago build remote stopCodexCoder21Organization/AiCliSupervisorManagerEmbeddedRemote stop attempt 11 for check run 123241570738 failed: foundation.url.protocol.sandbox.SandboxException: Sandboxed code threw an exception: java.lang.InternalError: Exception encountered in implementation of foundation/url/sjvm/intrinsics/ServiceBridge:rpc(Ljava/lang/String;Ljava/util/Map;)Ljava/util/Map; : foundation.url.resolver.UrlResolutionException: RPC request 'supersedeBuildRun' failed: RELAY_ERROR - Handler error: RPC error: INTERNAL_ERROR - Cannot supersede build run 'c5e3d7e9': it is already in terminal status FAILED. Only in-progress builds can be superseded. cause: null. The cancellation stays saved; retrying in 1920000ms.this service
1d 5h ago build remote stopCodexCoder21Organization/AiCliSupervisorManagerEmbeddedRemote stop attempt 10 for check run 123241570738 failed: foundation.url.protocol.sandbox.SandboxException: Sandboxed code threw an exception: java.lang.InternalError: Exception encountered in implementation of foundation/url/sjvm/intrinsics/ServiceBridge:rpc(Ljava/lang/String;Ljava/util/Map;)Ljava/util/Map; : foundation.url.resolver.UrlResolutionException: RPC request 'supersedeBuildRun' failed: RELAY_ERROR - Handler error: RPC error: INTERNAL_ERROR - Cannot supersede build run 'c5e3d7e9': it is already in terminal status FAILED. Only in-progress builds can be superseded. cause: null. The cancellation stays saved; retrying in 1920000ms.this service
1d 6h ago build remote stopCodexCoder21Organization/AiCliSupervisorManagerEmbeddedRemote stop attempt 9 for check run 123241570738 failed: foundation.url.protocol.sandbox.SandboxException: Sandboxed code threw an exception: java.lang.InternalError: Exception encountered in implementation of foundation/url/sjvm/intrinsics/ServiceBridge:rpc(Ljava/lang/String;Ljava/util/Map;)Ljava/util/Map; : foundation.url.resolver.UrlResolutionException: RPC request 'supersedeBuildRun' failed: RELAY_ERROR - Handler error: RPC error: INTERNAL_ERROR - Cannot supersede build run 'c5e3d7e9': it is already in terminal status FAILED. Only in-progress builds can be superseded. cause: null. The cancellation stays saved; retrying in 1920000ms.this service
1d 7h ago build remote stopCodexCoder21Organization/AiCliSupervisorManagerEmbeddedRemote stop attempt 8 for check run 123241570738 failed: foundation.url.protocol.sandbox.SandboxException: Sandboxed code threw an exception: java.lang.InternalError: Exception encountered in implementation of foundation/url/sjvm/intrinsics/ServiceBridge:rpc(Ljava/lang/String;Ljava/util/Map;)Ljava/util/Map; : foundation.url.resolver.UrlResolutionException: RPC request 'supersedeBuildRun' failed: INTERNAL_ERROR - RPC error: INTERNAL_ERROR - Cannot supersede build run 'c5e3d7e9': it is already in terminal status FAILED. Only in-progress builds can be superseded. cause: null. The cancellation stays saved; retrying in 1920000ms.this service
1d 8h ago deliveryCodexCoder21Organization/AiCliSupervisorManagerEmbeddedGitHub delivered check_run.completed for CodexCoder21Organization/AiCliSupervisorManagerEmbedded.codexcoder21
1d 8h ago deliveryCodexCoder21Organization/AiCliSupervisorManagerEmbeddedGitHub delivered check_suite.completed for CodexCoder21Organization/AiCliSupervisorManagerEmbedded.codexcoder21
1d 8h ago completedCodexCoder21Organization/AiCliSupervisorManagerEmbeddedBuild never started because the runner was saturated: every build worker was already running a check. It waited 0s in the deferred queue before the existing local deferred-submission deadline expired.this service
1d 8h ago deliveryCodexCoder21Organization/AiCliSupervisorManagerEmbeddedGitHub delivered check_run.completed for CodexCoder21Organization/AiCliSupervisorManagerEmbedded.codexcoder21
1d 8h ago deliveryCodexCoder21Organization/AiCliSupervisorManagerEmbeddedGitHub delivered check_suite.completed for CodexCoder21Organization/AiCliSupervisorManagerEmbedded.codexcoder21
1d 8h ago deliveryCodexCoder21Organization/AiCliSupervisorManagerEmbeddedGitHub delivered check_run.completed for CodexCoder21Organization/AiCliSupervisorManagerEmbedded.codexcoder21
1d 8h ago deliveryCodexCoder21Organization/AiCliSupervisorManagerEmbeddedGitHub delivered check_suite.completed for CodexCoder21Organization/AiCliSupervisorManagerEmbedded.codexcoder21
1d 8h ago completedCodexCoder21Organization/AiCliSupervisorManagerEmbeddedBuild never started because the runner was saturated: every build worker was already running a check. It waited 0s in the deferred queue before the existing local deferred-submission deadline expired.this service
1d 8h ago completedCodexCoder21Organization/AiCliSupervisorManagerEmbeddedBuild never started because the runner was saturated: every build worker was already running a check. It waited 0s in the deferred queue before the existing local deferred-submission deadline expired.this service
1d 8h ago deliveryCodexCoder21Organization/AiCliSupervisorManagerEmbeddedGitHub delivered check_run.completed for CodexCoder21Organization/AiCliSupervisorManagerEmbedded.codexcoder21
1d 8h ago deliveryCodexCoder21Organization/AiCliSupervisorManagerEmbeddedGitHub delivered check_suite.completed for CodexCoder21Organization/AiCliSupervisorManagerEmbedded.codexcoder21
1d 8h ago completedCodexCoder21Organization/AiCliSupervisorManagerEmbeddedBuild never started because the runner was saturated: every build worker was already running a check. It waited 0s in the deferred queue before the existing local deferred-submission deadline expired.this service
1d 8h ago deliveryCodexCoder21Organization/AiCliSupervisorManagerEmbeddedGitHub delivered check_run.completed for CodexCoder21Organization/AiCliSupervisorManagerEmbedded.codexcoder21
1d 8h ago deliveryCodexCoder21Organization/AiCliSupervisorManagerEmbeddedGitHub delivered check_suite.completed for CodexCoder21Organization/AiCliSupervisorManagerEmbedded.codexcoder21
1d 8h ago completedCodexCoder21Organization/AiCliSupervisorManagerEmbeddedBuild never started because the runner was saturated: every build worker was already running a check. It waited 0s in the deferred queue before the existing local deferred-submission deadline expired.this service
1d 8h ago build remote stopCodexCoder21Organization/AiCliSupervisorManagerEmbeddedRemote stop attempt 7 for check run 123241570738 failed: foundation.url.protocol.sandbox.SandboxException: Sandboxed code threw an exception: java.lang.InternalError: Exception encountered in implementation of foundation/url/sjvm/intrinsics/ServiceBridge:rpc(Ljava/lang/String;Ljava/util/Map;)Ljava/util/Map; : foundation.url.resolver.UrlResolutionException: RPC request 'supersedeBuildRun' failed: INTERNAL_ERROR - RPC error: INTERNAL_ERROR - Cannot supersede build run 'c5e3d7e9': it is already in terminal status FAILED. Only in-progress builds can be superseded. cause: null. The cancellation stays saved; retrying in 1920000ms.this service
1d 9h ago deliveryCodexCoder21Organization/AiCliSupervisorManagerEmbeddedGitHub delivered check_run.completed for CodexCoder21Organization/AiCliSupervisorManagerEmbedded.codexcoder21
1d 9h ago deliveryCodexCoder21Organization/AiCliSupervisorManagerEmbeddedGitHub delivered check_suite.completed for CodexCoder21Organization/AiCliSupervisorManagerEmbedded.codexcoder21
1d 9h ago completedCodexCoder21Organization/AiCliSupervisorManagerEmbeddedBuild failed: 0 passed, 0 failed, 507 totalthis service
1d 9h ago build pendingCodexCoder21Organization/AiCliSupervisorManagerEmbeddedRemote run b78a0836 remains PENDING after 3223s of queue wait; waiting for buildtest admission.this service
1d 10h ago build remote stopCodexCoder21Organization/AiCliSupervisorManagerEmbeddedRemote stop attempt 6 for check run 123241570738 failed: foundation.url.protocol.sandbox.SandboxException: Sandboxed code threw an exception: java.lang.InternalError: Exception encountered in implementation of foundation/url/sjvm/intrinsics/ServiceBridge:rpc(Ljava/lang/String;Ljava/util/Map;)Ljava/util/Map; : foundation.url.resolver.UrlResolutionException: RPC request 'supersedeBuildRun' failed: INTERNAL_ERROR - RPC error: INTERNAL_ERROR - Cannot supersede build run 'c5e3d7e9': it is already in terminal status FAILED. Only in-progress builds can be superseded. cause: null. The cancellation stays saved; retrying in 1920000ms.this service
1d 10h ago build pendingCodexCoder21Organization/AiCliSupervisorManagerEmbeddedRemote run b78a0836 remains PENDING after 2863s of queue wait; waiting for buildtest admission.this service
1d 10h ago build pendingCodexCoder21Organization/AiCliSupervisorManagerEmbeddedRemote run b78a0836 remains PENDING after 2561s of queue wait; waiting for buildtest admission.this service
1d 10h ago build pendingCodexCoder21Organization/AiCliSupervisorManagerEmbeddedRemote run b78a0836 remains PENDING after 2258s of queue wait; waiting for buildtest admission.this service
1d 10h ago build pendingCodexCoder21Organization/AiCliSupervisorManagerEmbeddedRemote run b78a0836 remains PENDING after 1957s of queue wait; waiting for buildtest admission.this service
1d 10h ago build pendingCodexCoder21Organization/AiCliSupervisorManagerEmbeddedRemote run b78a0836 remains PENDING after 1641s of queue wait; waiting for buildtest admission.this service
1d 10h ago deliveryCodexCoder21Organization/AiCliSupervisorManagerEmbeddedGitHub delivered check_run.completed for CodexCoder21Organization/AiCliSupervisorManagerEmbedded.codexcoder21
1d 10h ago deliveryCodexCoder21Organization/AiCliSupervisorManagerEmbeddedGitHub delivered check_suite.completed for CodexCoder21Organization/AiCliSupervisorManagerEmbedded.codexcoder21
1d 10h ago completedCodexCoder21Organization/AiCliSupervisorManagerEmbeddedBuild never started because the runner was saturated: every build worker was already running a check. It waited 5s in the deferred queue before the existing local deferred-submission deadline expired.this service
1d 10h ago build pendingCodexCoder21Organization/AiCliSupervisorManagerEmbeddedRemote run b78a0836 remains PENDING after 1051s of queue wait; waiting for buildtest admission.this service
1d 10h ago build pendingCodexCoder21Organization/AiCliSupervisorManagerEmbeddedRemote run b78a0836 remains PENDING after 745s of queue wait; waiting for buildtest admission.this service
1d 10h ago deliveryCodexCoder21Organization/AiCliSupervisorManagerEmbeddedGitHub delivered check_run.completed for CodexCoder21Organization/AiCliSupervisorManagerEmbedded.codexcoder21
1d 10h ago completedCodexCoder21Organization/AiCliSupervisorManagerEmbeddedBuild never started because the runner was saturated: every build worker was already running a check. It waited 3s in the deferred queue before the existing local deferred-submission deadline expired.this service
1d 10h ago build pendingCodexCoder21Organization/AiCliSupervisorManagerEmbeddedRemote run b78a0836 remains PENDING after 414s of queue wait; waiting for buildtest admission.this service
1d 10h ago deliveryCodexCoder21Organization/AiCliSupervisorManagerEmbeddedGitHub delivered check_run.completed for CodexCoder21Organization/AiCliSupervisorManagerEmbedded.codexcoder21
1d 10h ago completedCodexCoder21Organization/AiCliSupervisorManagerEmbeddedBuild never started because the runner was saturated: every build worker was already running a check. It waited 2s in the deferred queue before the existing local deferred-submission deadline expired.this service
1d 10h ago deliveryCodexCoder21Organization/AiCliSupervisorManagerEmbeddedGitHub delivered check_run.completed for CodexCoder21Organization/AiCliSupervisorManagerEmbedded.codexcoder21
1d 10h ago deliveryCodexCoder21Organization/AiCliSupervisorManagerEmbeddedGitHub delivered check_run.created for CodexCoder21Organization/AiCliSupervisorManagerEmbedded.codexcoder21
1d 10h ago dispatchedCodexCoder21Organization/AiCliSupervisorManagerEmbeddedSubmitted to the direct-buildtest build service.this service
1d 10h ago deliveryCodexCoder21Organization/AiCliSupervisorManagerEmbeddedGitHub delivered check_run.created for CodexCoder21Organization/AiCliSupervisorManagerEmbedded.codexcoder21
1d 10h ago build remote stopCodexCoder21Organization/AiCliSupervisorManagerEmbeddedRemote stop attempt 5 for check run 123241570738 failed: foundation.url.protocol.sandbox.SandboxException: Sandboxed code threw an exception: java.lang.InternalError: Exception encountered in implementation of foundation/url/sjvm/intrinsics/ServiceBridge:rpc(Ljava/lang/String;Ljava/util/Map;)Ljava/util/Map; : foundation.url.resolver.UrlResolutionException: RPC request 'supersedeBuildRun' failed: INTERNAL_ERROR - RPC error: INTERNAL_ERROR - Cannot supersede build run 'c5e3d7e9': it is already in terminal status FAILED. Only in-progress builds can be superseded. cause: null. The cancellation stays saved; retrying in 960000ms.this service
1d 10h ago deliveryCodexCoder21Organization/AiCliSupervisorManagerEmbeddedGitHub delivered check_run.completed for CodexCoder21Organization/AiCliSupervisorManagerEmbedded.codexcoder21
1d 10h ago completedCodexCoder21Organization/AiCliSupervisorManagerEmbeddedBuild never started because the runner was saturated: every build worker was already running a check. It waited 2s in the deferred queue before the existing local deferred-submission deadline expired.this service
1d 10h ago deliveryCodexCoder21Organization/AiCliSupervisorManagerEmbeddedGitHub delivered check_run.completed for CodexCoder21Organization/AiCliSupervisorManagerEmbedded.codexcoder21
1d 10h ago completedCodexCoder21Organization/AiCliSupervisorManagerEmbeddedBuild never started because the runner was saturated: every build worker was already running a check. It waited 0s in the deferred queue before the existing local deferred-submission deadline expired.this service
1d 11h ago deliveryCodexCoder21Organization/AiCliSupervisorManagerEmbeddedGitHub delivered check_run.completed for CodexCoder21Organization/AiCliSupervisorManagerEmbedded.codexcoder21
1d 11h ago completedCodexCoder21Organization/AiCliSupervisorManagerEmbeddedBuild never started because the runner was saturated: every build worker was already running a check. It waited 2s in the deferred queue before the existing local deferred-submission deadline expired.this service
1d 11h ago deliveryCodexCoder21Organization/AiCliSupervisorManagerEmbeddedGitHub delivered check_run.completed for CodexCoder21Organization/AiCliSupervisorManagerEmbedded.codexcoder21
1d 11h ago completedCodexCoder21Organization/AiCliSupervisorManagerEmbeddedBuild never started because the runner was saturated: every build worker was already running a check. It waited 0s in the deferred queue before the existing local deferred-submission deadline expired.this service
1d 11h ago deliveryCodexCoder21Organization/AiCliSupervisorManagerEmbeddedGitHub delivered check_run.completed for CodexCoder21Organization/AiCliSupervisorManagerEmbedded.codexcoder21
1d 11h ago deliveryCodexCoder21Organization/AiCliSupervisorManagerEmbeddedGitHub delivered check_suite.completed for CodexCoder21Organization/AiCliSupervisorManagerEmbedded.codexcoder21
1d 11h ago deliveryCodexCoder21Organization/AiCliSupervisorManagerEmbeddedGitHub delivered check_run.completed for CodexCoder21Organization/AiCliSupervisorManagerEmbedded.codexcoder21
1d 11h ago completedCodexCoder21Organization/AiCliSupervisorManagerEmbeddedBuild never started because the runner was saturated: every build worker was already running a check. It waited 2s in the deferred queue before the existing local deferred-submission deadline expired.this service
1d 11h ago deliveryCodexCoder21Organization/AiCliSupervisorManagerEmbeddedGitHub delivered check_run.completed for CodexCoder21Organization/AiCliSupervisorManagerEmbedded.codexcoder21
1d 11h ago completedCodexCoder21Organization/AiCliSupervisorManagerEmbeddedBuild never started because the runner was saturated: every build worker was already running a check. It waited 1s in the deferred queue before the existing local deferred-submission deadline expired.this service
1d 11h ago deliveryCodexCoder21Organization/AiCliSupervisorManagerEmbeddedGitHub delivered check_run.completed for CodexCoder21Organization/AiCliSupervisorManagerEmbedded.codexcoder21
1d 11h ago completedCodexCoder21Organization/AiCliSupervisorManagerEmbeddedBuild never started because the runner was saturated: every build worker was already running a check. It waited 2s in the deferred queue before the existing local deferred-submission deadline expired.this service
1d 11h ago build remote stopCodexCoder21Organization/AiCliSupervisorManagerEmbeddedRemote stop attempt 4 for check run 123241570738 failed: foundation.url.protocol.sandbox.SandboxException: Sandboxed code threw an exception: java.lang.InternalError: Exception encountered in implementation of foundation/url/sjvm/intrinsics/ServiceBridge:rpc(Ljava/lang/String;Ljava/util/Map;)Ljava/util/Map; : foundation.url.resolver.UrlResolutionException: RPC request 'supersedeBuildRun' failed: INTERNAL_ERROR - RPC error: INTERNAL_ERROR - Cannot supersede build run 'c5e3d7e9': it is already in terminal status FAILED. Only in-progress builds can be superseded. cause: null. The cancellation stays saved; retrying in 480000ms.this service
1d 11h ago deliveryCodexCoder21Organization/AiCliSupervisorManagerEmbeddedGitHub delivered check_run.completed for CodexCoder21Organization/AiCliSupervisorManagerEmbedded.codexcoder21
1d 11h ago deliveryCodexCoder21Organization/AiCliSupervisorManagerEmbeddedGitHub delivered check_suite.completed for CodexCoder21Organization/AiCliSupervisorManagerEmbedded.codexcoder21
1d 11h ago completedCodexCoder21Organization/AiCliSupervisorManagerEmbeddedA newer commit was pushed to PR #52, so this build is no longer current and was stopped. The check for the new commit reports the result that counts.this service
1d 11h ago deliveryCodexCoder21Organization/AiCliSupervisorManagerEmbeddedGitHub delivered check_run.completed for CodexCoder21Organization/AiCliSupervisorManagerEmbedded.codexcoder21
1d 11h ago deliveryCodexCoder21Organization/AiCliSupervisorManagerEmbeddedGitHub delivered check_suite.completed for CodexCoder21Organization/AiCliSupervisorManagerEmbedded.codexcoder21
1d 11h ago completedCodexCoder21Organization/AiCliSupervisorManagerEmbeddedBuild never started because the runner was saturated: every build worker was already running a check. It waited 1s in the deferred queue before the existing local deferred-submission deadline expired.this service
1d 11h ago deliveryCodexCoder21Organization/AiCliSupervisorManagerEmbeddedGitHub delivered check_run.completed for CodexCoder21Organization/AiCliSupervisorManagerEmbedded.codexcoder21
1d 11h ago completedCodexCoder21Organization/AiCliSupervisorManagerEmbeddedBuild never started because the runner was saturated: every build worker was already running a check. It waited 1s in the deferred queue before the existing local deferred-submission deadline expired.this service
1d 11h ago deliveryCodexCoder21Organization/AiCliSupervisorManagerEmbeddedGitHub delivered check_run.completed for CodexCoder21Organization/AiCliSupervisorManagerEmbedded.codexcoder21
1d 11h ago deliveryCodexCoder21Organization/AiCliSupervisorManagerEmbeddedGitHub delivered check_suite.completed for CodexCoder21Organization/AiCliSupervisorManagerEmbedded.codexcoder21
1d 11h ago deliveryCodexCoder21Organization/AiCliSupervisorManagerEmbeddedGitHub delivered check_run.completed for CodexCoder21Organization/AiCliSupervisorManagerEmbedded.codexcoder21
1d 11h ago completedCodexCoder21Organization/AiCliSupervisorManagerEmbeddedBuild never started because the runner was saturated: every build worker was already running a check. It waited 2s in the deferred queue before the existing local deferred-submission deadline expired.this service
1d 11h ago deliveryCodexCoder21Organization/AiCliSupervisorManagerEmbeddedGitHub delivered check_suite.completed for CodexCoder21Organization/AiCliSupervisorManagerEmbedded.codexcoder21
1d 11h ago deliveryCodexCoder21Organization/AiCliSupervisorManagerEmbeddedGitHub delivered check_run.completed for CodexCoder21Organization/AiCliSupervisorManagerEmbedded.codexcoder21
1d 11h ago completedCodexCoder21Organization/AiCliSupervisorManagerEmbeddedBuild never started because the runner was saturated: every build worker was already running a check. It waited 1s in the deferred queue before the existing local deferred-submission deadline expired.this service
1d 11h ago deliveryCodexCoder21Organization/AiCliSupervisorManagerEmbeddedGitHub delivered check_run.completed for CodexCoder21Organization/AiCliSupervisorManagerEmbedded.codexcoder21
1d 11h ago deliveryCodexCoder21Organization/AiCliSupervisorManagerEmbeddedGitHub delivered check_suite.completed for CodexCoder21Organization/AiCliSupervisorManagerEmbedded.codexcoder21
1d 11h ago completedCodexCoder21Organization/AiCliSupervisorManagerEmbeddedBuild never started because the runner was saturated: every build worker was already running a check. It waited 3s in the deferred queue before the existing local deferred-submission deadline expired.this service
1d 11h ago deliveryCodexCoder21Organization/AiCliSupervisorManagerEmbeddedGitHub delivered check_suite.completed for CodexCoder21Organization/AiCliSupervisorManagerEmbedded.codexcoder21
1d 11h ago deliveryCodexCoder21Organization/AiCliSupervisorManagerEmbeddedGitHub delivered check_run.completed for CodexCoder21Organization/AiCliSupervisorManagerEmbedded.codexcoder21
1d 11h ago completedCodexCoder21Organization/AiCliSupervisorManagerEmbeddedBuild never started because the runner was saturated: every build worker was already running a check. It waited 5s in the deferred queue before the existing local deferred-submission deadline expired.this service
1d 11h ago deliveryCodexCoder21Organization/AiCliSupervisorManagerEmbeddedGitHub delivered check_run.completed for CodexCoder21Organization/AiCliSupervisorManagerEmbedded.codexcoder21
1d 11h ago completedCodexCoder21Organization/AiCliSupervisorManagerEmbeddedBuild never started because the runner was saturated: every build worker was already running a check. It waited 2s in the deferred queue before the existing local deferred-submission deadline expired.this service
1d 11h ago deliveryCodexCoder21Organization/AiCliSupervisorManagerEmbeddedGitHub delivered check_run.completed for CodexCoder21Organization/AiCliSupervisorManagerEmbedded.codexcoder21
1d 11h ago completedCodexCoder21Organization/AiCliSupervisorManagerEmbeddedBuild never started because the runner was saturated: every build worker was already running a check. It waited 3s in the deferred queue before the existing local deferred-submission deadline expired.this service
1d 11h ago deliveryCodexCoder21Organization/AiCliSupervisorManagerEmbeddedGitHub delivered check_run.completed for CodexCoder21Organization/AiCliSupervisorManagerEmbedded.codexcoder21
1d 11h ago completedCodexCoder21Organization/AiCliSupervisorManagerEmbeddedBuild never started because the runner was saturated: every build worker was already running a check. It waited 26s in the deferred queue before the existing local deferred-submission deadline expired.this service
1d 11h ago deliveryCodexCoder21Organization/AiCliSupervisorManagerEmbeddedGitHub delivered check_run.completed for CodexCoder21Organization/AiCliSupervisorManagerEmbedded.codexcoder21
1d 11h ago completedCodexCoder21Organization/AiCliSupervisorManagerEmbeddedBuild never started because the runner was saturated: every build worker was already running a check. It waited 4s in the deferred queue before the existing local deferred-submission deadline expired.this service
1d 11h ago deliveryCodexCoder21Organization/AiCliSupervisorManagerEmbeddedGitHub delivered check_run.completed for CodexCoder21Organization/AiCliSupervisorManagerEmbedded.codexcoder21
1d 11h ago completedCodexCoder21Organization/AiCliSupervisorManagerEmbeddedBuild never started because the runner was saturated: every build worker was already running a check. It waited 2s in the deferred queue before the existing local deferred-submission deadline expired.this service
1d 11h ago deliveryCodexCoder21Organization/AiCliSupervisorManagerEmbeddedGitHub delivered check_run.completed for CodexCoder21Organization/AiCliSupervisorManagerEmbedded.codexcoder21
1d 11h ago deliveryCodexCoder21Organization/AiCliSupervisorManagerEmbeddedGitHub delivered check_suite.completed for CodexCoder21Organization/AiCliSupervisorManagerEmbedded.codexcoder21
1d 11h ago completedCodexCoder21Organization/AiCliSupervisorManagerEmbeddedBuild never started because the runner was saturated: every build worker was already running a check. It waited 2s in the deferred queue before the existing local deferred-submission deadline expired.this service
1d 11h ago deliveryCodexCoder21Organization/AiCliSupervisorManagerEmbeddedGitHub delivered check_run.completed for CodexCoder21Organization/AiCliSupervisorManagerEmbedded.codexcoder21
1d 11h ago deliveryCodexCoder21Organization/AiCliSupervisorManagerEmbeddedGitHub delivered check_suite.completed for CodexCoder21Organization/AiCliSupervisorManagerEmbedded.codexcoder21
1d 11h ago deliveryCodexCoder21Organization/AiCliSupervisorManagerEmbeddedGitHub delivered check_run.completed for CodexCoder21Organization/AiCliSupervisorManagerEmbedded.codexcoder21
1d 11h ago deliveryCodexCoder21Organization/AiCliSupervisorManagerEmbeddedGitHub delivered check_suite.completed for CodexCoder21Organization/AiCliSupervisorManagerEmbedded.codexcoder21
1d 11h ago completedCodexCoder21Organization/AiCliSupervisorManagerEmbeddedBuild infrastructure error: java.lang.RuntimeException: Upload of build 628b2bb1 failed after 5 attempts. Upload attribution for 'CodexCoder21Organization/AiCliSupervisorManagerEmbedded': stalled step=uploadChunk, chunk 0 of 9, upload session=628b2bb1, upload sessions created=1, createUploadSession attempts=2, upload attempts=5, last completed step=createUploadSession at 1793228656037 (2026-10-28T23:04:16.037Z), last error=foundation.url.protocol.sandbox.SandboxException: Sandboxed code threw an exception: java.lang.InternalError: Exception encountered in implementation of foundation/url/sjvm/intrinsics/ServiceBridge:rpc(Ljava/lang/String;Ljava/util/Map;)Ljava/util/Map; :this service
1d 11h ago deliveryCodexCoder21Organization/AiCliSupervisorManagerEmbeddedGitHub delivered check_run.completed for CodexCoder21Organization/AiCliSupervisorManagerEmbedded.codexcoder21
1d 11h ago deliveryCodexCoder21Organization/AiCliSupervisorManagerEmbeddedGitHub delivered check_suite.completed for CodexCoder21Organization/AiCliSupervisorManagerEmbedded.codexcoder21
1d 11h ago completedCodexCoder21Organization/AiCliSupervisorManagerEmbeddedBuild never started because the runner was saturated: every build worker was already running a check. It waited 35s in the deferred queue before the existing local deferred-submission deadline expired.this service
1d 12h ago deliveryCodexCoder21Organization/AiCliSupervisorManagerEmbeddedGitHub delivered check_suite.completed for CodexCoder21Organization/AiCliSupervisorManagerEmbedded.codexcoder21
1d 12h ago deliveryCodexCoder21Organization/AiCliSupervisorManagerEmbeddedGitHub delivered check_run.completed for CodexCoder21Organization/AiCliSupervisorManagerEmbedded.codexcoder21
1d 12h ago deliveryCodexCoder21Organization/AiCliSupervisorManagerEmbeddedGitHub delivered check_run.completed for CodexCoder21Organization/AiCliSupervisorManagerEmbedded.codexcoder21
1d 12h ago completedCodexCoder21Organization/AiCliSupervisorManagerEmbeddedBuild never started because the runner was saturated: every build worker was already running a check. It waited 23s in the deferred queue before the existing local deferred-submission deadline expired.this service
1d 12h ago deliveryCodexCoder21Organization/AiCliSupervisorManagerEmbeddedGitHub delivered check_run.completed for CodexCoder21Organization/AiCliSupervisorManagerEmbedded.codexcoder21
1d 12h ago completedCodexCoder21Organization/AiCliSupervisorManagerEmbeddedBuild never started because the runner was saturated: every build worker was already running a check. It waited 3s in the deferred queue before the existing local deferred-submission deadline expired.this service
1d 12h ago deliveryCodexCoder21Organization/AiCliSupervisorManagerEmbeddedGitHub delivered check_run.completed for CodexCoder21Organization/AiCliSupervisorManagerEmbedded.codexcoder21
1d 12h ago completedCodexCoder21Organization/AiCliSupervisorManagerEmbeddedBuild never started because the runner was saturated: every build worker was already running a check. It waited 3s in the deferred queue before the existing local deferred-submission deadline expired.this service
1d 12h ago deliveryCodexCoder21Organization/AiCliSupervisorManagerEmbeddedGitHub delivered check_run.completed for CodexCoder21Organization/AiCliSupervisorManagerEmbedded.codexcoder21
1d 12h ago completedCodexCoder21Organization/AiCliSupervisorManagerEmbeddedBuild never started because the runner was saturated: every build worker was already running a check. It waited 50s in the deferred queue before the existing local deferred-submission deadline expired.this service
1d 12h ago deliveryCodexCoder21Organization/AiCliSupervisorManagerEmbeddedGitHub delivered check_run.completed for CodexCoder21Organization/AiCliSupervisorManagerEmbedded.codexcoder21
1d 12h ago deliveryCodexCoder21Organization/AiCliSupervisorManagerEmbeddedGitHub delivered check_run.completed for CodexCoder21Organization/AiCliSupervisorManagerEmbedded.codexcoder21
1d 12h ago deliveryCodexCoder21Organization/AiCliSupervisorManagerEmbeddedGitHub delivered check_suite.completed for CodexCoder21Organization/AiCliSupervisorManagerEmbedded.codexcoder21
1d 12h ago completedCodexCoder21Organization/AiCliSupervisorManagerEmbeddedBuild never started because the runner was saturated: every build worker was already running a check. It waited 42s in the deferred queue before the existing local deferred-submission deadline expired.this service
1d 12h ago completedCodexCoder21Organization/AiCliSupervisorManagerEmbeddedBuild never started because the runner was saturated: every build worker was already running a check. It waited 6s in the deferred queue before the existing local deferred-submission deadline expired.this service
1d 13h ago build pendingCodexCoder21Organization/AiCliSupervisorManagerEmbeddedRemote run ae4f5c6d remains PENDING after 3119s of queue wait; waiting for buildtest admission.this service
1d 13h ago build pendingCodexCoder21Organization/AiCliSupervisorManagerEmbeddedRemote run ae4f5c6d remains PENDING after 2681s of queue wait; waiting for buildtest admission.this service
1d 13h ago build pendingCodexCoder21Organization/AiCliSupervisorManagerEmbeddedRemote run ae4f5c6d remains PENDING after 2232s of queue wait; waiting for buildtest admission.this service
1d 13h ago build pendingCodexCoder21Organization/AiCliSupervisorManagerEmbeddedRemote run ae4f5c6d remains PENDING after 1153s of queue wait; waiting for buildtest admission.this service
1d 13h ago deliveryCodexCoder21Organization/AiCliSupervisorManagerEmbeddedGitHub delivered check_run.completed for CodexCoder21Organization/AiCliSupervisorManagerEmbedded.codexcoder21
1d 13h ago deliveryCodexCoder21Organization/AiCliSupervisorManagerEmbeddedGitHub delivered check_run.completed for CodexCoder21Organization/AiCliSupervisorManagerEmbedded.codexcoder21