kotlin.build CI

Trigger log

Every delivery GitHub sent and what this service did with it — including the ones that produced no build. Newest first.

WhenWhatRepositoryDetailWho
23m 37s ago build remote stopCodexCoder21Organization/AiCliSupervisorManagerServiceServerRemote stop attempt 45 for check run 122962881975 failed: foundation.url.protocol.sandbox.SandboxException: Sandboxed code threw an exception: java.lang.InternalError: Exception encountered in implementation of foundation/url/sjvm/intrinsics/ServiceBridge:rpc(Ljava/lang/String;Ljava/util/Map;)Ljava/util/Map; : foundation.url.resolver.UrlResolutionException: RPC request 'supersedeBuildRun' failed: INTERNAL_ERROR - RPC error: INTERNAL_ERROR - Cannot supersede build run '1300c6e8': it is already in terminal status COMPLETED. Only in-progress builds can be superseded. cause: null. The cancellation stays saved; retrying in 1920000ms.this service
1h 15m ago build remote stopCodexCoder21Organization/AiCliSupervisorManagerServiceServerRemote stop attempt 44 for check run 122962881975 failed: foundation.url.protocol.sandbox.SandboxException: Sandboxed code threw an exception: java.lang.InternalError: Exception encountered in implementation of foundation/url/sjvm/intrinsics/ServiceBridge:rpc(Ljava/lang/String;Ljava/util/Map;)Ljava/util/Map; : foundation.url.resolver.UrlResolutionException: RPC request 'supersedeBuildRun' failed: INTERNAL_ERROR - RPC error: INTERNAL_ERROR - Cannot supersede build run '1300c6e8': it is already in terminal status COMPLETED. Only in-progress builds can be superseded. cause: null. The cancellation stays saved; retrying in 1920000ms.this service
2h 3m ago build remote stopCodexCoder21Organization/AiCliSupervisorManagerServiceServerRemote stop attempt 43 for check run 122962881975 failed: foundation.url.protocol.sandbox.SandboxException: Sandboxed code threw an exception: java.lang.InternalError: Exception encountered in implementation of foundation/url/sjvm/intrinsics/ServiceBridge:rpc(Ljava/lang/String;Ljava/util/Map;)Ljava/util/Map; : foundation.url.resolver.UrlResolutionException: RPC request 'supersedeBuildRun' failed: INTERNAL_ERROR - RPC error: INTERNAL_ERROR - Cannot supersede build run '1300c6e8': it is already in terminal status COMPLETED. Only in-progress builds can be superseded. cause: null. The cancellation stays saved; retrying in 1920000ms.this service
2h 22m ago deliveryCodexCoder21Organization/AiCliSupervisorManagerServiceServerGitHub delivered check_run.completed for CodexCoder21Organization/AiCliSupervisorManagerServiceServer.codexcoder21
2h 22m ago deliveryCodexCoder21Organization/AiCliSupervisorManagerServiceServerGitHub delivered check_suite.completed for CodexCoder21Organization/AiCliSupervisorManagerServiceServer.codexcoder21
2h 23m ago deliveryCodexCoder21Organization/AiCliSupervisorManagerServiceServerGitHub delivered check_run.completed for CodexCoder21Organization/AiCliSupervisorManagerServiceServer.codexcoder21
2h 23m ago deliveryCodexCoder21Organization/AiCliSupervisorManagerServiceServerGitHub delivered check_suite.completed for CodexCoder21Organization/AiCliSupervisorManagerServiceServer.codexcoder21
2h 23m ago deliveryCodexCoder21Organization/AiCliSupervisorManagerServiceServerGitHub delivered check_run.completed for CodexCoder21Organization/AiCliSupervisorManagerServiceServer.codexcoder21
2h 23m ago deliveryCodexCoder21Organization/AiCliSupervisorManagerServiceServerGitHub delivered check_suite.completed for CodexCoder21Organization/AiCliSupervisorManagerServiceServer.codexcoder21
2h 49m ago build remote stopCodexCoder21Organization/AiCliSupervisorManagerServiceServerRemote stop attempt 42 for check run 122962881975 failed: foundation.url.protocol.sandbox.SandboxException: Sandboxed code threw an exception: java.lang.InternalError: Exception encountered in implementation of foundation/url/sjvm/intrinsics/ServiceBridge:rpc(Ljava/lang/String;Ljava/util/Map;)Ljava/util/Map; : foundation.url.resolver.UrlResolutionException: RPC request 'supersedeBuildRun' failed: INTERNAL_ERROR - RPC error: INTERNAL_ERROR - Cannot supersede build run '1300c6e8': it is already in terminal status COMPLETED. Only in-progress builds can be superseded. cause: null. The cancellation stays saved; retrying in 1920000ms.this service
3h 21m ago build recovery failedCodexCoder21Organization/AiCliSupervisorManagerServiceServerFailed to recover shadow check 119572784719: foundation.url.protocol.sandbox.SandboxException: Sandboxed code threw an exception: java.lang.InternalError: Exception encountered in implementation of foundation/url/sjvm/intrinsics/ServiceBridge:rpc(Ljava/lang/String;Ljava/util/Map;)Ljava/util/Map; : foundation.url.resolver.UrlResolutionException: RPC request 'finalizeUpload' failed: INTERNAL_ERROR - RPC error: -1 - CiUploadSessionNotFoundException: No CI upload session exists with id '7da188f3-0f8a-4f50-bd64-328f253e6294'. cause: null at foundation.url.resolver.sandbox.TypeMarshaling.fromJvmResult$foundation_url_resolver_sandbox(TypeMarshaling.kt:692) at foundation.url.resolver.sandbox.InstanceMethodDispatcher$invokeWithActivity$3.invoke(SandboxedProxyGenerator.kt:2106) at foundation.url.resolver.sandbox.InstanceMethodDispatcher$invokeWithActivity$3.invoke(SandboxedProxyGenerator.kt:2037) at foundation.url.resolver.sandbox.SandboxedProxyGeneratorKt$invokeSandboxMethod$future$1$result$1.invoke(SandboxedProxyGenerator.kt:1491) at community.kotlin.clocks.hierarchical.RequiredClockPadKt.withRequiredClockPad(RequiredClockPad.kt:89) at foundation.url.resolver.sandbox.SandboxedProxyGeneratorKt.invokeSandboxMethod$lambda$4(SandboxedProxyGenerator.kt:1491) at java.base/java.util.concurrent.FutureTask.run(FutureTask.java:317) at foundation.url.resolver.sandbox.SandboxInvocationLane.runScheduled(SandboxedProxyGenerator.kt:1379) at foundation.url.resolver.sandbox.SandboxInvocationLane.schedule$lambda$5(SandboxedProxyGenerator.kt:1370) at java.base/java.util.concurrent.ThreadPoolExecutor.runWorker(ThreadPoolExecutor.java:1144) at java.base/java.util.concurrent.ThreadPoolExecutor$Worker.run(ThreadPoolExecutor.java:642) at java.base/java.lang.Thread.run(Thread.java:1583) Caused by: java.lang.RuntimeException: java.lang.InternalError: Exception encountered in implementation of foundation/url/sjvm/intrinsics/ServiceBridge:rpc(Ljava/lang/String;Ljava/util/Map;)Ljava/util/Map; : foundation.url.resolver.UrlResolutionException: RPC request 'finalizeUpload' failed: INTERNAL_ERROR - RPC error: -1 - CiUploadSessionNotFoundException: No CI upload session exists with id '7da188f3-0f8a-4f50-bd64-328f253e6294'. at foundation.url.resolver.sandbox.TypeMarshaling.fromJvmResult$foundation_url_resolver_sandbox(TypeMarshaling.kt:695) ... 11 more this service
4h 4m ago build remote stopCodexCoder21Organization/AiCliSupervisorManagerServiceServerRemote stop attempt 41 for check run 122962881975 failed: foundation.url.protocol.sandbox.SandboxException: Sandboxed code threw an exception: java.lang.InternalError: Exception encountered in implementation of foundation/url/sjvm/intrinsics/ServiceBridge:rpc(Ljava/lang/String;Ljava/util/Map;)Ljava/util/Map; : foundation.url.resolver.UrlResolutionException: RPC request 'supersedeBuildRun' failed: INTERNAL_ERROR - RPC error: INTERNAL_ERROR - Cannot supersede build run '1300c6e8': it is already in terminal status COMPLETED. Only in-progress builds can be superseded. cause: null. The cancellation stays saved; retrying in 1920000ms.this service
4h 51m ago build remote stopCodexCoder21Organization/AiCliSupervisorManagerServiceServerRemote stop attempt 40 for check run 122962881975 failed: foundation.url.protocol.sandbox.SandboxException: Sandboxed code threw an exception: java.lang.InternalError: Exception encountered in implementation of foundation/url/sjvm/intrinsics/ServiceBridge:rpc(Ljava/lang/String;Ljava/util/Map;)Ljava/util/Map; : foundation.url.resolver.UrlResolutionException: RPC request 'supersedeBuildRun' failed: INTERNAL_ERROR - RPC error: INTERNAL_ERROR - Cannot supersede build run '1300c6e8': it is already in terminal status COMPLETED. Only in-progress builds can be superseded. cause: null. The cancellation stays saved; retrying in 1920000ms.this service
5h 44m ago build remote stopCodexCoder21Organization/AiCliSupervisorManagerServiceServerRemote stop attempt 39 for check run 122962881975 failed: foundation.url.protocol.sandbox.SandboxException: Sandboxed code threw an exception: java.lang.InternalError: Exception encountered in implementation of foundation/url/sjvm/intrinsics/ServiceBridge:rpc(Ljava/lang/String;Ljava/util/Map;)Ljava/util/Map; : foundation.url.resolver.UrlResolutionException: RPC request 'supersedeBuildRun' failed: INTERNAL_ERROR - RPC error: INTERNAL_ERROR - Cannot supersede build run '1300c6e8': it is already in terminal status COMPLETED. Only in-progress builds can be superseded. cause: null. The cancellation stays saved; retrying in 1920000ms.this service
6h 35m ago build remote stopCodexCoder21Organization/AiCliSupervisorManagerServiceServerRemote stop attempt 38 for check run 122962881975 failed: foundation.url.protocol.sandbox.SandboxException: Sandboxed code threw an exception: java.lang.InternalError: Exception encountered in implementation of foundation/url/sjvm/intrinsics/ServiceBridge:rpc(Ljava/lang/String;Ljava/util/Map;)Ljava/util/Map; : foundation.url.resolver.UrlResolutionException: RPC request 'supersedeBuildRun' failed: INTERNAL_ERROR - RPC error: INTERNAL_ERROR - Cannot supersede build run '1300c6e8': it is already in terminal status COMPLETED. Only in-progress builds can be superseded. cause: null. The cancellation stays saved; retrying in 1920000ms.this service
7h 26m ago build remote stopCodexCoder21Organization/AiCliSupervisorManagerServiceServerRemote stop attempt 37 for check run 122962881975 failed: foundation.url.protocol.sandbox.SandboxException: Sandboxed code threw an exception: java.lang.InternalError: Exception encountered in implementation of foundation/url/sjvm/intrinsics/ServiceBridge:rpc(Ljava/lang/String;Ljava/util/Map;)Ljava/util/Map; : foundation.url.resolver.UrlResolutionException: RPC request 'supersedeBuildRun' failed: INTERNAL_ERROR - RPC error: INTERNAL_ERROR - Cannot supersede build run '1300c6e8': it is already in terminal status COMPLETED. Only in-progress builds can be superseded. cause: null. The cancellation stays saved; retrying in 1920000ms.this service
8h 19m ago build remote stopCodexCoder21Organization/AiCliSupervisorManagerServiceServerRemote stop attempt 36 for check run 122962881975 failed: foundation.url.protocol.sandbox.SandboxException: Sandboxed code threw an exception: java.lang.InternalError: Exception encountered in implementation of foundation/url/sjvm/intrinsics/ServiceBridge:rpc(Ljava/lang/String;Ljava/util/Map;)Ljava/util/Map; : foundation.url.resolver.UrlResolutionException: RPC request 'supersedeBuildRun' failed: INTERNAL_ERROR - RPC error: INTERNAL_ERROR - Cannot supersede build run '1300c6e8': it is already in terminal status COMPLETED. Only in-progress builds can be superseded. cause: null. The cancellation stays saved; retrying in 1920000ms.this service
9h 5m ago deliveryCodexCoder21Organization/AiCliSupervisorManagerServiceServerGitHub delivered check_run.completed for CodexCoder21Organization/AiCliSupervisorManagerServiceServer.codexcoder21
9h 5m ago deliveryCodexCoder21Organization/AiCliSupervisorManagerServiceServerGitHub delivered check_suite.completed for CodexCoder21Organization/AiCliSupervisorManagerServiceServer.codexcoder21
9h 13m ago build recovery failedCodexCoder21Organization/AiCliSupervisorManagerServiceServerFailed to recover shadow check 121805732282: foundation.url.protocol.sandbox.SandboxException: Sandboxed code threw an exception: java.lang.InternalError: Exception encountered in implementation of foundation/url/sjvm/intrinsics/ServiceBridge:rpc(Ljava/lang/String;Ljava/util/Map;)Ljava/util/Map; : foundation.url.resolver.UrlResolutionException: RPC request 'finalizeUpload' failed: INTERNAL_ERROR - RPC error: -1 - CiUploadSessionNotFoundException: No CI upload session exists with id '623f416a-bbde-471e-8eef-7e17da24e047'. cause: null at foundation.url.resolver.sandbox.TypeMarshaling.fromJvmResult$foundation_url_resolver_sandbox(TypeMarshaling.kt:692) at foundation.url.resolver.sandbox.InstanceMethodDispatcher$invokeWithActivity$3.invoke(SandboxedProxyGenerator.kt:2106) at foundation.url.resolver.sandbox.InstanceMethodDispatcher$invokeWithActivity$3.invoke(SandboxedProxyGenerator.kt:2037) at foundation.url.resolver.sandbox.SandboxedProxyGeneratorKt$invokeSandboxMethod$future$1$result$1.invoke(SandboxedProxyGenerator.kt:1491) at community.kotlin.clocks.hierarchical.RequiredClockPadKt.withRequiredClockPad(RequiredClockPad.kt:89) at foundation.url.resolver.sandbox.SandboxedProxyGeneratorKt.invokeSandboxMethod$lambda$4(SandboxedProxyGenerator.kt:1491) at java.base/java.util.concurrent.FutureTask.run(FutureTask.java:317) at foundation.url.resolver.sandbox.SandboxInvocationLane.runScheduled(SandboxedProxyGenerator.kt:1379) at foundation.url.resolver.sandbox.SandboxInvocationLane.schedule$lambda$5(SandboxedProxyGenerator.kt:1370) at java.base/java.util.concurrent.ThreadPoolExecutor.runWorker(ThreadPoolExecutor.java:1144) at java.base/java.util.concurrent.ThreadPoolExecutor$Worker.run(ThreadPoolExecutor.java:642) at java.base/java.lang.Thread.run(Thread.java:1583) Caused by: java.lang.RuntimeException: java.lang.InternalError: Exception encountered in implementation of foundation/url/sjvm/intrinsics/ServiceBridge:rpc(Ljava/lang/String;Ljava/util/Map;)Ljava/util/Map; : foundation.url.resolver.UrlResolutionException: RPC request 'finalizeUpload' failed: INTERNAL_ERROR - RPC error: -1 - CiUploadSessionNotFoundException: No CI upload session exists with id '623f416a-bbde-471e-8eef-7e17da24e047'. at foundation.url.resolver.sandbox.TypeMarshaling.fromJvmResult$foundation_url_resolver_sandbox(TypeMarshaling.kt:695) ... 11 more this service
9h 19m ago build remote stopCodexCoder21Organization/AiCliSupervisorManagerServiceServerRemote stop attempt 35 for check run 122962881975 failed: foundation.url.protocol.sandbox.SandboxException: Sandboxed code threw an exception: java.lang.InternalError: Exception encountered in implementation of foundation/url/sjvm/intrinsics/ServiceBridge:rpc(Ljava/lang/String;Ljava/util/Map;)Ljava/util/Map; : foundation.url.resolver.UrlResolutionException: RPC request 'supersedeBuildRun' failed: INTERNAL_ERROR - RPC error: INTERNAL_ERROR - BuildTest service is not ready for 'supersedeBuildRun': startup recovery is in phase RECOVERING_LOCAL_STATE (elapsedMs=286636). No operation was performed. cause: null. The cancellation stays saved; retrying in 1920000ms.this service
10h 10m ago build remote stopCodexCoder21Organization/AiCliSupervisorManagerServiceServerRemote stop attempt 34 for check run 122962881975 failed: foundation.url.protocol.sandbox.SandboxException: Sandboxed code threw an exception: java.lang.InternalError: Exception encountered in implementation of foundation/url/sjvm/intrinsics/ServiceBridge:rpc(Ljava/lang/String;Ljava/util/Map;)Ljava/util/Map; : foundation.url.resolver.UrlResolutionException: RPC request 'supersedeBuildRun' failed: INTERNAL_ERROR - RPC error: INTERNAL_ERROR - Cannot supersede build run '1300c6e8': it is already in terminal status COMPLETED. Only in-progress builds can be superseded. cause: null. The cancellation stays saved; retrying in 1920000ms.this service
11h 7m ago build remote stopCodexCoder21Organization/AiCliSupervisorManagerServiceServerRemote stop attempt 33 for check run 122962881975 failed: foundation.url.protocol.sandbox.SandboxException: Sandboxed code threw an exception: java.lang.InternalError: Exception encountered in implementation of foundation/url/sjvm/intrinsics/ServiceBridge:rpc(Ljava/lang/String;Ljava/util/Map;)Ljava/util/Map; : foundation.url.resolver.UrlResolutionException: RPC request 'supersedeBuildRun' failed: INTERNAL_ERROR - RPC error: INTERNAL_ERROR - Cannot supersede build run '1300c6e8': it is already in terminal status COMPLETED. Only in-progress builds can be superseded. cause: null. The cancellation stays saved; retrying in 1920000ms.this service
11h 50m ago build remote stopCodexCoder21Organization/AiCliSupervisorManagerServiceServerRemote stop attempt 32 for check run 122962881975 failed: foundation.url.protocol.sandbox.SandboxException: Sandboxed code threw an exception: java.lang.InternalError: Exception encountered in implementation of foundation/url/sjvm/intrinsics/ServiceBridge:rpc(Ljava/lang/String;Ljava/util/Map;)Ljava/util/Map; : foundation.url.resolver.UrlResolutionException: RPC request 'supersedeBuildRun' failed: INTERNAL_ERROR - RPC error: INTERNAL_ERROR - Cannot supersede build run '1300c6e8': it is already in terminal status COMPLETED. Only in-progress builds can be superseded. cause: null. The cancellation stays saved; retrying in 1920000ms.this service
12h 32m ago build remote stopCodexCoder21Organization/AiCliSupervisorManagerServiceServerRemote stop attempt 31 for check run 122962881975 failed: foundation.url.protocol.sandbox.SandboxException: Sandboxed code threw an exception: java.lang.InternalError: Exception encountered in implementation of foundation/url/sjvm/intrinsics/ServiceBridge:rpc(Ljava/lang/String;Ljava/util/Map;)Ljava/util/Map; : foundation.url.resolver.UrlResolutionException: RPC request 'supersedeBuildRun' failed: INTERNAL_ERROR - RPC error: INTERNAL_ERROR - Cannot supersede build run '1300c6e8': it is already in terminal status COMPLETED. Only in-progress builds can be superseded. cause: null. The cancellation stays saved; retrying in 1920000ms.this service
13h 23m ago build remote stopCodexCoder21Organization/AiCliSupervisorManagerServiceServerRemote stop attempt 30 for check run 122962881975 failed: foundation.url.protocol.sandbox.SandboxException: Sandboxed code threw an exception: java.lang.InternalError: Exception encountered in implementation of foundation/url/sjvm/intrinsics/ServiceBridge:rpc(Ljava/lang/String;Ljava/util/Map;)Ljava/util/Map; : foundation.url.resolver.UrlResolutionException: RPC request 'supersedeBuildRun' failed: INTERNAL_ERROR - RPC error: INTERNAL_ERROR - Cannot supersede build run '1300c6e8': it is already in terminal status COMPLETED. Only in-progress builds can be superseded. cause: null. The cancellation stays saved; retrying in 1920000ms.this service
14h 9m ago build remote stopCodexCoder21Organization/AiCliSupervisorManagerServiceServerRemote stop attempt 29 for check run 122962881975 failed: foundation.url.protocol.sandbox.SandboxException: Sandboxed code threw an exception: java.lang.InternalError: Exception encountered in implementation of foundation/url/sjvm/intrinsics/ServiceBridge:rpc(Ljava/lang/String;Ljava/util/Map;)Ljava/util/Map; : foundation.url.resolver.UrlResolutionException: RPC request 'supersedeBuildRun' failed: INTERNAL_ERROR - RPC error: INTERNAL_ERROR - Cannot supersede build run '1300c6e8': it is already in terminal status COMPLETED. Only in-progress builds can be superseded. cause: null. The cancellation stays saved; retrying in 1920000ms.this service
15h 1m ago build remote stopCodexCoder21Organization/AiCliSupervisorManagerServiceServerRemote stop attempt 28 for check run 122962881975 failed: foundation.url.protocol.sandbox.SandboxException: Sandboxed code threw an exception: java.lang.InternalError: Exception encountered in implementation of foundation/url/sjvm/intrinsics/ServiceBridge:rpc(Ljava/lang/String;Ljava/util/Map;)Ljava/util/Map; : foundation.url.resolver.UrlResolutionException: RPC request 'supersedeBuildRun' failed: INTERNAL_ERROR - RPC error: INTERNAL_ERROR - Cannot supersede build run '1300c6e8': it is already in terminal status COMPLETED. Only in-progress builds can be superseded. cause: null. The cancellation stays saved; retrying in 1920000ms.this service
15h 45m ago build remote stopCodexCoder21Organization/AiCliSupervisorManagerServiceServerRemote stop attempt 27 for check run 122962881975 failed: foundation.url.protocol.sandbox.SandboxException: Sandboxed code threw an exception: java.lang.InternalError: Exception encountered in implementation of foundation/url/sjvm/intrinsics/ServiceBridge:rpc(Ljava/lang/String;Ljava/util/Map;)Ljava/util/Map; : foundation.url.resolver.UrlResolutionException: RPC request 'supersedeBuildRun' failed: INTERNAL_ERROR - RPC error: INTERNAL_ERROR - Cannot supersede build run '1300c6e8': it is already in terminal status COMPLETED. Only in-progress builds can be superseded. cause: null. The cancellation stays saved; retrying in 1920000ms.this service
16h 52m ago build remote stopCodexCoder21Organization/AiCliSupervisorManagerServiceServerRemote stop attempt 26 for check run 122962881975 failed: foundation.url.protocol.sandbox.SandboxException: Sandboxed code threw an exception: java.lang.InternalError: Exception encountered in implementation of foundation/url/sjvm/intrinsics/ServiceBridge:rpc(Ljava/lang/String;Ljava/util/Map;)Ljava/util/Map; : foundation.url.resolver.UrlResolutionException: RPC request 'supersedeBuildRun' failed: INTERNAL_ERROR - RPC error: INTERNAL_ERROR - Cannot supersede build run '1300c6e8': it is already in terminal status COMPLETED. Only in-progress builds can be superseded. cause: null. The cancellation stays saved; retrying in 1920000ms.this service
17h 45m ago build remote stopCodexCoder21Organization/AiCliSupervisorManagerServiceServerRemote stop attempt 25 for check run 122962881975 failed: foundation.url.protocol.sandbox.SandboxException: Sandboxed code threw an exception: java.lang.InternalError: Exception encountered in implementation of foundation/url/sjvm/intrinsics/ServiceBridge:rpc(Ljava/lang/String;Ljava/util/Map;)Ljava/util/Map; : foundation.url.resolver.UrlResolutionException: RPC request 'supersedeBuildRun' failed: INTERNAL_ERROR - RPC error: INTERNAL_ERROR - Cannot supersede build run '1300c6e8': it is already in terminal status COMPLETED. Only in-progress builds can be superseded. cause: null. The cancellation stays saved; retrying in 1920000ms.this service
18h 34m ago build remote stopCodexCoder21Organization/AiCliSupervisorManagerServiceServerRemote stop attempt 24 for check run 122962881975 failed: foundation.url.protocol.sandbox.SandboxException: Sandboxed code threw an exception: java.lang.InternalError: Exception encountered in implementation of foundation/url/sjvm/intrinsics/ServiceBridge:rpc(Ljava/lang/String;Ljava/util/Map;)Ljava/util/Map; : foundation.url.resolver.UrlResolutionException: RPC request 'supersedeBuildRun' failed: INTERNAL_ERROR - RPC error: INTERNAL_ERROR - Cannot supersede build run '1300c6e8': it is already in terminal status COMPLETED. Only in-progress builds can be superseded. cause: null. The cancellation stays saved; retrying in 1920000ms.this service
19h 22m ago build remote stopCodexCoder21Organization/AiCliSupervisorManagerServiceServerRemote stop attempt 23 for check run 122962881975 failed: foundation.url.protocol.sandbox.SandboxException: Sandboxed code threw an exception: java.lang.InternalError: Exception encountered in implementation of foundation/url/sjvm/intrinsics/ServiceBridge:rpc(Ljava/lang/String;Ljava/util/Map;)Ljava/util/Map; : foundation.url.resolver.UrlResolutionException: RPC request 'supersedeBuildRun' failed: INTERNAL_ERROR - RPC error: INTERNAL_ERROR - Cannot supersede build run '1300c6e8': it is already in terminal status COMPLETED. Only in-progress builds can be superseded. cause: null. The cancellation stays saved; retrying in 1920000ms.this service
20h 8m ago build remote stopCodexCoder21Organization/AiCliSupervisorManagerServiceServerRemote stop attempt 22 for check run 122962881975 failed: foundation.url.protocol.sandbox.SandboxException: Sandboxed code threw an exception: java.lang.InternalError: Exception encountered in implementation of foundation/url/sjvm/intrinsics/ServiceBridge:rpc(Ljava/lang/String;Ljava/util/Map;)Ljava/util/Map; : foundation.url.resolver.UrlResolutionException: RPC request 'supersedeBuildRun' failed: INTERNAL_ERROR - RPC error: INTERNAL_ERROR - Cannot supersede build run '1300c6e8': it is already in terminal status COMPLETED. Only in-progress builds can be superseded. cause: null. The cancellation stays saved; retrying in 1920000ms.this service
21h 4m ago build remote stopCodexCoder21Organization/AiCliSupervisorManagerServiceServerRemote stop attempt 21 for check run 122962881975 failed: foundation.url.protocol.sandbox.SandboxException: Sandboxed code threw an exception: java.lang.InternalError: Exception encountered in implementation of foundation/url/sjvm/intrinsics/ServiceBridge:rpc(Ljava/lang/String;Ljava/util/Map;)Ljava/util/Map; : foundation.url.resolver.UrlResolutionException: RPC request 'supersedeBuildRun' failed: INTERNAL_ERROR - RPC error: INTERNAL_ERROR - Cannot supersede build run '1300c6e8': it is already in terminal status COMPLETED. Only in-progress builds can be superseded. cause: null. The cancellation stays saved; retrying in 1920000ms.this service
21h 48m ago build remote stopCodexCoder21Organization/AiCliSupervisorManagerServiceServerRemote stop attempt 20 for check run 122962881975 failed: foundation.url.protocol.sandbox.SandboxException: Sandboxed code threw an exception: java.lang.InternalError: Exception encountered in implementation of foundation/url/sjvm/intrinsics/ServiceBridge:rpc(Ljava/lang/String;Ljava/util/Map;)Ljava/util/Map; : foundation.url.resolver.UrlResolutionException: RPC request 'supersedeBuildRun' failed: INTERNAL_ERROR - RPC error: INTERNAL_ERROR - Cannot supersede build run '1300c6e8': it is already in terminal status COMPLETED. Only in-progress builds can be superseded. cause: null. The cancellation stays saved; retrying in 1920000ms.this service
22h 34m ago build remote stopCodexCoder21Organization/AiCliSupervisorManagerServiceServerRemote stop attempt 19 for check run 122962881975 failed: foundation.url.protocol.sandbox.SandboxException: Sandboxed code threw an exception: java.lang.InternalError: Exception encountered in implementation of foundation/url/sjvm/intrinsics/ServiceBridge:rpc(Ljava/lang/String;Ljava/util/Map;)Ljava/util/Map; : foundation.url.resolver.UrlResolutionException: RPC request 'supersedeBuildRun' failed: INTERNAL_ERROR - RPC error: INTERNAL_ERROR - Cannot supersede build run '1300c6e8': it is already in terminal status COMPLETED. Only in-progress builds can be superseded. cause: null. The cancellation stays saved; retrying in 1920000ms.this service
23h 20m ago build remote stopCodexCoder21Organization/AiCliSupervisorManagerServiceServerRemote stop attempt 18 for check run 122962881975 failed: foundation.url.protocol.sandbox.SandboxException: Sandboxed code threw an exception: java.lang.InternalError: Exception encountered in implementation of foundation/url/sjvm/intrinsics/ServiceBridge:rpc(Ljava/lang/String;Ljava/util/Map;)Ljava/util/Map; : foundation.url.resolver.UrlResolutionException: RPC request 'supersedeBuildRun' failed: INTERNAL_ERROR - RPC error: INTERNAL_ERROR - Cannot supersede build run '1300c6e8': it is already in terminal status COMPLETED. Only in-progress builds can be superseded. cause: null. The cancellation stays saved; retrying in 1920000ms.this service
1d 0h ago build remote stopCodexCoder21Organization/AiCliSupervisorManagerServiceServerRemote stop attempt 17 for check run 122962881975 failed: foundation.url.protocol.sandbox.SandboxException: Sandboxed code threw an exception: java.lang.InternalError: Exception encountered in implementation of foundation/url/sjvm/intrinsics/ServiceBridge:rpc(Ljava/lang/String;Ljava/util/Map;)Ljava/util/Map; : foundation.url.resolver.UrlResolutionException: RPC request 'supersedeBuildRun' failed: INTERNAL_ERROR - RPC error: INTERNAL_ERROR - Cannot supersede build run '1300c6e8': it is already in terminal status COMPLETED. Only in-progress builds can be superseded. cause: null. The cancellation stays saved; retrying in 1920000ms.this service
1d 1h ago build remote stopCodexCoder21Organization/AiCliSupervisorManagerServiceServerRemote stop attempt 16 for check run 122962881975 failed: foundation.url.protocol.sandbox.SandboxException: Sandboxed code threw an exception: java.lang.InternalError: Exception encountered in implementation of foundation/url/sjvm/intrinsics/ServiceBridge:rpc(Ljava/lang/String;Ljava/util/Map;)Ljava/util/Map; : foundation.url.resolver.UrlResolutionException: RPC request 'supersedeBuildRun' failed: INTERNAL_ERROR - RPC error: INTERNAL_ERROR - Cannot supersede build run '1300c6e8': it is already in terminal status COMPLETED. Only in-progress builds can be superseded. cause: null. The cancellation stays saved; retrying in 1920000ms.this service
1d 2h ago build remote stopCodexCoder21Organization/AiCliSupervisorManagerServiceServerRemote stop attempt 15 for check run 122962881975 failed: foundation.url.protocol.sandbox.SandboxException: Sandboxed code threw an exception: java.lang.InternalError: Exception encountered in implementation of foundation/url/sjvm/intrinsics/ServiceBridge:rpc(Ljava/lang/String;Ljava/util/Map;)Ljava/util/Map; : foundation.url.resolver.UrlResolutionException: RPC request 'supersedeBuildRun' failed: INTERNAL_ERROR - RPC error: INTERNAL_ERROR - Cannot supersede build run '1300c6e8': it is already in terminal status COMPLETED. Only in-progress builds can be superseded. cause: null. The cancellation stays saved; retrying in 1920000ms.this service
1d 2h ago build remote stopCodexCoder21Organization/AiCliSupervisorManagerServiceServerRemote stop attempt 14 for check run 122962881975 failed: foundation.url.protocol.sandbox.SandboxException: Sandboxed code threw an exception: java.lang.InternalError: Exception encountered in implementation of foundation/url/sjvm/intrinsics/ServiceBridge:rpc(Ljava/lang/String;Ljava/util/Map;)Ljava/util/Map; : foundation.url.resolver.UrlResolutionException: RPC request 'supersedeBuildRun' failed: RELAY_ERROR - Handler error: RPC error: INTERNAL_ERROR - Cannot supersede build run '1300c6e8': it is already in terminal status COMPLETED. Only in-progress builds can be superseded. cause: null. The cancellation stays saved; retrying in 1920000ms.this service
1d 3h ago build remote stopCodexCoder21Organization/AiCliSupervisorManagerServiceServerRemote stop attempt 13 for check run 122962881975 failed: foundation.url.protocol.sandbox.SandboxException: Sandboxed code threw an exception: java.lang.InternalError: Exception encountered in implementation of foundation/url/sjvm/intrinsics/ServiceBridge:rpc(Ljava/lang/String;Ljava/util/Map;)Ljava/util/Map; : foundation.url.resolver.UrlResolutionException: RPC request 'supersedeBuildRun' failed: RELAY_ERROR - Handler error: RPC error: INTERNAL_ERROR - Cannot supersede build run '1300c6e8': it is already in terminal status COMPLETED. Only in-progress builds can be superseded. cause: null. The cancellation stays saved; retrying in 1920000ms.this service
1d 3h ago build remote stopCodexCoder21Organization/AiCliSupervisorManagerServiceServerRemote stop attempt 12 for check run 122962881975 failed: foundation.url.protocol.sandbox.SandboxException: Sandboxed code threw an exception: java.lang.InternalError: Exception encountered in implementation of foundation/url/sjvm/intrinsics/ServiceBridge:rpc(Ljava/lang/String;Ljava/util/Map;)Ljava/util/Map; : foundation.url.resolver.UrlResolutionException: RPC request 'supersedeBuildRun' failed: RELAY_ERROR - Handler error: RPC error: INTERNAL_ERROR - Cannot supersede build run '1300c6e8': it is already in terminal status COMPLETED. Only in-progress builds can be superseded. cause: null. The cancellation stays saved; retrying in 1920000ms.this service
1d 4h ago build remote stopCodexCoder21Organization/AiCliSupervisorManagerServiceServerRemote stop attempt 11 for check run 122962881975 failed: foundation.url.protocol.sandbox.SandboxException: Sandboxed code threw an exception: java.lang.InternalError: Exception encountered in implementation of foundation/url/sjvm/intrinsics/ServiceBridge:rpc(Ljava/lang/String;Ljava/util/Map;)Ljava/util/Map; : foundation.url.resolver.UrlResolutionException: RPC request 'supersedeBuildRun' failed: RELAY_ERROR - Handler error: RPC error: INTERNAL_ERROR - Cannot supersede build run '1300c6e8': it is already in terminal status COMPLETED. Only in-progress builds can be superseded. cause: null. The cancellation stays saved; retrying in 1920000ms.this service
1d 5h ago build remote stopCodexCoder21Organization/AiCliSupervisorManagerServiceServerRemote stop attempt 10 for check run 122962881975 failed: foundation.url.protocol.sandbox.SandboxException: Sandboxed code threw an exception: java.lang.InternalError: Exception encountered in implementation of foundation/url/sjvm/intrinsics/ServiceBridge:rpc(Ljava/lang/String;Ljava/util/Map;)Ljava/util/Map; : foundation.url.resolver.UrlResolutionException: RPC request 'supersedeBuildRun' failed: RELAY_ERROR - Handler error: RPC error: INTERNAL_ERROR - Cannot supersede build run '1300c6e8': it is already in terminal status COMPLETED. Only in-progress builds can be superseded. cause: null. The cancellation stays saved; retrying in 1920000ms.this service
1d 6h ago build remote stopCodexCoder21Organization/AiCliSupervisorManagerServiceServerRemote stop attempt 9 for check run 122962881975 failed: foundation.url.protocol.sandbox.SandboxException: Sandboxed code threw an exception: java.lang.InternalError: Exception encountered in implementation of foundation/url/sjvm/intrinsics/ServiceBridge:rpc(Ljava/lang/String;Ljava/util/Map;)Ljava/util/Map; : foundation.url.resolver.UrlResolutionException: RPC request 'supersedeBuildRun' failed: RELAY_ERROR - Handler error: RPC error: INTERNAL_ERROR - Cannot supersede build run '1300c6e8': it is already in terminal status COMPLETED. Only in-progress builds can be superseded. cause: null. The cancellation stays saved; retrying in 1920000ms.this service
1d 7h ago build remote stopCodexCoder21Organization/AiCliSupervisorManagerServiceServerRemote stop attempt 8 for check run 122962881975 failed: foundation.url.protocol.sandbox.SandboxException: Sandboxed code threw an exception: java.lang.InternalError: Exception encountered in implementation of foundation/url/sjvm/intrinsics/ServiceBridge:rpc(Ljava/lang/String;Ljava/util/Map;)Ljava/util/Map; : foundation.url.resolver.UrlResolutionException: RPC request 'supersedeBuildRun' failed: INTERNAL_ERROR - RPC error: INTERNAL_ERROR - Cannot supersede build run '1300c6e8': it is already in terminal status COMPLETED. Only in-progress builds can be superseded. cause: null. The cancellation stays saved; retrying in 1920000ms.this service
1d 9h ago deliveryCodexCoder21Organization/AiCliSupervisorManagerServiceServerGitHub delivered check_suite.completed for CodexCoder21Organization/AiCliSupervisorManagerServiceServer.codexcoder21
1d 9h ago deliveryCodexCoder21Organization/AiCliSupervisorManagerServiceServerGitHub delivered check_run.completed for CodexCoder21Organization/AiCliSupervisorManagerServiceServer.codexcoder21
1d 9h ago completedCodexCoder21Organization/AiCliSupervisorManagerServiceServerAll tests passing (68/68)this service
1d 9h ago deliveryCodexCoder21Organization/AiCliSupervisorManagerServiceServerGitHub delivered check_run.completed for CodexCoder21Organization/AiCliSupervisorManagerServiceServer.codexcoder21
1d 9h ago deliveryCodexCoder21Organization/AiCliSupervisorManagerServiceServerGitHub delivered check_run.completed for CodexCoder21Organization/AiCliSupervisorManagerServiceServer.codexcoder21
1d 9h ago deliveryCodexCoder21Organization/AiCliSupervisorManagerServiceServerGitHub delivered check_suite.completed for CodexCoder21Organization/AiCliSupervisorManagerServiceServer.codexcoder21
1d 9h ago deliveryCodexCoder21Organization/AiCliSupervisorManagerServiceServerGitHub delivered check_suite.completed for CodexCoder21Organization/AiCliSupervisorManagerServiceServer.codexcoder21
1d 9h ago completedCodexCoder21Organization/AiCliSupervisorManagerServiceServerAll tests passing (68/68)this service
1d 9h ago completedCodexCoder21Organization/AiCliSupervisorManagerServiceServerAll tests passing (67/67)this service
1d 9h ago deliveryCodexCoder21Organization/AiCliSupervisorManagerServiceServerGitHub delivered check_run.completed for CodexCoder21Organization/AiCliSupervisorManagerServiceServer.codexcoder21
1d 9h ago deliveryCodexCoder21Organization/AiCliSupervisorManagerServiceServerGitHub delivered check_suite.completed for CodexCoder21Organization/AiCliSupervisorManagerServiceServer.codexcoder21
1d 9h ago completedCodexCoder21Organization/AiCliSupervisorManagerServiceServerAll tests passing (70/70)this service
1d 9h ago deliveryCodexCoder21Organization/AiCliSupervisorManagerServiceServerGitHub delivered check_run.completed for CodexCoder21Organization/AiCliSupervisorManagerServiceServer.codexcoder21
1d 9h ago deliveryCodexCoder21Organization/AiCliSupervisorManagerServiceServerGitHub delivered check_suite.completed for CodexCoder21Organization/AiCliSupervisorManagerServiceServer.codexcoder21
1d 9h ago completedCodexCoder21Organization/AiCliSupervisorManagerServiceServerBuild failed: 0 passed, 2 failed, 71 totalthis service
1d 9h ago build pendingCodexCoder21Organization/AiCliSupervisorManagerServiceServerRemote run 511ad3f1 remains PENDING after 3279s of queue wait; waiting for buildtest admission.this service
1d 9h ago build pendingCodexCoder21Organization/AiCliSupervisorManagerServiceServerRemote run 87adf174 remains PENDING after 3280s of queue wait; waiting for buildtest admission.this service
1d 9h ago build pendingCodexCoder21Organization/AiCliSupervisorManagerServiceServerRemote run 0c3851fb remains PENDING after 3277s of queue wait; waiting for buildtest admission.this service
1d 9h ago build pendingCodexCoder21Organization/AiCliSupervisorManagerServiceServerRemote run 0a16aa29 remains PENDING after 226518s of queue wait; waiting for buildtest admission.this service
1d 9h ago build pendingCodexCoder21Organization/AiCliSupervisorManagerServiceServerRemote run 8fd1b634 remains PENDING after 210800s of queue wait; waiting for buildtest admission.this service
1d 10h ago build pendingCodexCoder21Organization/AiCliSupervisorManagerServiceServerRemote run 511ad3f1 remains PENDING after 2942s of queue wait; waiting for buildtest admission.this service
1d 10h ago build pendingCodexCoder21Organization/AiCliSupervisorManagerServiceServerRemote run 87adf174 remains PENDING after 2975s of queue wait; waiting for buildtest admission.this service
1d 10h ago build pendingCodexCoder21Organization/AiCliSupervisorManagerServiceServerRemote run 0c3851fb remains PENDING after 2902s of queue wait; waiting for buildtest admission.this service
1d 10h ago build pendingCodexCoder21Organization/AiCliSupervisorManagerServiceServerRemote run 0a16aa29 remains PENDING after 226122s of queue wait; waiting for buildtest admission.this service
1d 10h ago build pendingCodexCoder21Organization/AiCliSupervisorManagerServiceServerRemote run 8fd1b634 remains PENDING after 210405s of queue wait; waiting for buildtest admission.this service
1d 10h ago build pendingCodexCoder21Organization/AiCliSupervisorManagerServiceServerRemote run 511ad3f1 remains PENDING after 2634s of queue wait; waiting for buildtest admission.this service
1d 10h ago build pendingCodexCoder21Organization/AiCliSupervisorManagerServiceServerRemote run 87adf174 remains PENDING after 2605s of queue wait; waiting for buildtest admission.this service
1d 10h ago build pendingCodexCoder21Organization/AiCliSupervisorManagerServiceServerRemote run 0c3851fb remains PENDING after 2582s of queue wait; waiting for buildtest admission.this service
1d 10h ago build pendingCodexCoder21Organization/AiCliSupervisorManagerServiceServerRemote run 511ad3f1 remains PENDING after 2180s of queue wait; waiting for buildtest admission.this service
1d 10h ago build pendingCodexCoder21Organization/AiCliSupervisorManagerServiceServerRemote run 0c3851fb remains PENDING after 2243s of queue wait; waiting for buildtest admission.this service
1d 10h ago build pendingCodexCoder21Organization/AiCliSupervisorManagerServiceServerRemote run 87adf174 remains PENDING after 2217s of queue wait; waiting for buildtest admission.this service
1d 10h ago build pendingCodexCoder21Organization/AiCliSupervisorManagerServiceServerRemote run 0a16aa29 remains PENDING after 225557s of queue wait; waiting for buildtest admission.this service
1d 10h ago build remote stopCodexCoder21Organization/AiCliSupervisorManagerServiceServerRemote stop attempt 7 for check run 122962881975 failed: foundation.url.protocol.sandbox.SandboxException: Sandboxed code threw an exception: java.lang.InternalError: Exception encountered in implementation of foundation/url/sjvm/intrinsics/ServiceBridge:rpc(Ljava/lang/String;Ljava/util/Map;)Ljava/util/Map; : foundation.url.resolver.UrlResolutionException: RPC request 'supersedeBuildRun' failed: INTERNAL_ERROR - RPC error: INTERNAL_ERROR - Cannot supersede build run '1300c6e8': it is already in terminal status COMPLETED. Only in-progress builds can be superseded. cause: null. The cancellation stays saved; retrying in 1920000ms.this service
1d 10h ago build pendingCodexCoder21Organization/AiCliSupervisorManagerServiceServerRemote run 8fd1b634 remains PENDING after 209559s of queue wait; waiting for buildtest admission.this service
1d 10h ago build pendingCodexCoder21Organization/AiCliSupervisorManagerServiceServerRemote run 0c3851fb remains PENDING after 1917s of queue wait; waiting for buildtest admission.this service
1d 10h ago build pendingCodexCoder21Organization/AiCliSupervisorManagerServiceServerRemote run 511ad3f1 remains PENDING after 1801s of queue wait; waiting for buildtest admission.this service
1d 10h ago build pendingCodexCoder21Organization/AiCliSupervisorManagerServiceServerRemote run 87adf174 remains PENDING after 1891s of queue wait; waiting for buildtest admission.this service
1d 10h ago build pendingCodexCoder21Organization/AiCliSupervisorManagerServiceServerRemote run 0a16aa29 remains PENDING after 224981s of queue wait; waiting for buildtest admission.this service
1d 10h ago build pendingCodexCoder21Organization/AiCliSupervisorManagerServiceServerRemote run 8fd1b634 remains PENDING after 209218s of queue wait; waiting for buildtest admission.this service
1d 10h ago build pendingCodexCoder21Organization/AiCliSupervisorManagerServiceServerRemote run 87adf174 remains PENDING after 1575s of queue wait; waiting for buildtest admission.this service
1d 10h ago build pendingCodexCoder21Organization/AiCliSupervisorManagerServiceServerRemote run 0c3851fb remains PENDING after 1590s of queue wait; waiting for buildtest admission.this service
1d 10h ago build pendingCodexCoder21Organization/AiCliSupervisorManagerServiceServerRemote run 511ad3f1 remains PENDING after 1477s of queue wait; waiting for buildtest admission.this service
1d 10h ago build pendingCodexCoder21Organization/AiCliSupervisorManagerServiceServerRemote run 511ad3f1 remains PENDING after 1049s of queue wait; waiting for buildtest admission.this service
1d 10h ago deliveryCodexCoder21Organization/AiCliSupervisorManagerServiceServerGitHub delivered check_run.completed for CodexCoder21Organization/AiCliSupervisorManagerServiceServer.codexcoder21
1d 10h ago completedCodexCoder21Organization/AiCliSupervisorManagerServiceServerAll tests passing (67/67)this service
1d 10h ago build pendingCodexCoder21Organization/AiCliSupervisorManagerServiceServerRemote run 87adf174 remains PENDING after 1075s of queue wait; waiting for buildtest admission.this service
1d 10h ago build pendingCodexCoder21Organization/AiCliSupervisorManagerServiceServerRemote run 0c3851fb remains PENDING after 1077s of queue wait; waiting for buildtest admission.this service
1d 10h ago build pendingCodexCoder21Organization/AiCliSupervisorManagerServiceServerRemote run 0a16aa29 remains PENDING after 224231s of queue wait; waiting for buildtest admission.this service
1d 10h ago build pendingCodexCoder21Organization/AiCliSupervisorManagerServiceServerRemote run 511ad3f1 remains PENDING after 704s of queue wait; waiting for buildtest admission.this service
1d 10h ago build pendingCodexCoder21Organization/AiCliSupervisorManagerServiceServerRemote run 0c3851fb remains PENDING after 765s of queue wait; waiting for buildtest admission.this service
1d 10h ago build pendingCodexCoder21Organization/AiCliSupervisorManagerServiceServerRemote run 87adf174 remains PENDING after 745s of queue wait; waiting for buildtest admission.this service
1d 10h ago build pendingCodexCoder21Organization/AiCliSupervisorManagerServiceServerRemote run 8fd1b634 remains PENDING after 208320s of queue wait; waiting for buildtest admission.this service
1d 10h ago build pendingCodexCoder21Organization/AiCliSupervisorManagerServiceServerRemote run 511ad3f1 remains PENDING after 399s of queue wait; waiting for buildtest admission.this service
1d 10h ago build pendingCodexCoder21Organization/AiCliSupervisorManagerServiceServerRemote run 87adf174 remains PENDING after 445s of queue wait; waiting for buildtest admission.this service
1d 10h ago build pendingCodexCoder21Organization/AiCliSupervisorManagerServiceServerRemote run 0c3851fb remains PENDING after 458s of queue wait; waiting for buildtest admission.this service
1d 10h ago deliveryCodexCoder21Organization/AiCliSupervisorManagerServiceServerGitHub delivered check_run.completed for CodexCoder21Organization/AiCliSupervisorManagerServiceServer.codexcoder21
1d 10h ago deliveryCodexCoder21Organization/AiCliSupervisorManagerServiceServerGitHub delivered check_run.created for CodexCoder21Organization/AiCliSupervisorManagerServiceServer.codexcoder21
1d 10h ago dispatchedCodexCoder21Organization/AiCliSupervisorManagerServiceServerSubmitted to the direct-buildtest build service.this service
1d 10h ago deliveryCodexCoder21Organization/AiCliSupervisorManagerServiceServerGitHub delivered check_run.created for CodexCoder21Organization/AiCliSupervisorManagerServiceServer.codexcoder21
1d 10h ago deliveryCodexCoder21Organization/AiCliSupervisorManagerServiceServerGitHub delivered check_run.completed for CodexCoder21Organization/AiCliSupervisorManagerServiceServer.codexcoder21
1d 10h ago deliveryCodexCoder21Organization/AiCliSupervisorManagerServiceServerGitHub delivered check_run.completed for CodexCoder21Organization/AiCliSupervisorManagerServiceServer.codexcoder21
1d 10h ago deliveryCodexCoder21Organization/AiCliSupervisorManagerServiceServerGitHub delivered check_run.created for CodexCoder21Organization/AiCliSupervisorManagerServiceServer.codexcoder21
1d 10h ago dispatchedCodexCoder21Organization/AiCliSupervisorManagerServiceServerSubmitted to the direct-buildtest build service.this service
1d 10h ago deliveryCodexCoder21Organization/AiCliSupervisorManagerServiceServerGitHub delivered check_run.created for CodexCoder21Organization/AiCliSupervisorManagerServiceServer.codexcoder21
1d 10h ago deliveryCodexCoder21Organization/AiCliSupervisorManagerServiceServerGitHub delivered check_run.created for CodexCoder21Organization/AiCliSupervisorManagerServiceServer.codexcoder21
1d 10h ago dispatchedCodexCoder21Organization/AiCliSupervisorManagerServiceServerSubmitted to the direct-buildtest build service.this service
1d 10h ago deliveryCodexCoder21Organization/AiCliSupervisorManagerServiceServerGitHub delivered check_run.created for CodexCoder21Organization/AiCliSupervisorManagerServiceServer.codexcoder21
1d 10h ago build pendingCodexCoder21Organization/AiCliSupervisorManagerServiceServerRemote run 8fd1b634 remains PENDING after 207542s of queue wait; waiting for buildtest admission.this service
1d 10h ago build pendingCodexCoder21Organization/AiCliSupervisorManagerServiceServerRemote run 0a16aa29 remains PENDING after 223126s of queue wait; waiting for buildtest admission.this service
1d 10h ago build pendingCodexCoder21Organization/AiCliSupervisorManagerServiceServerRemote run 584f76ae remains PENDING after 225761s of queue wait; waiting for buildtest admission.this service
1d 11h ago build pendingCodexCoder21Organization/AiCliSupervisorManagerServiceServerRemote run 8fd1b634 remains PENDING after 207014s of queue wait; waiting for buildtest admission.this service
1d 11h ago build pendingCodexCoder21Organization/AiCliSupervisorManagerServiceServerRemote run 0a16aa29 remains PENDING after 222698s of queue wait; waiting for buildtest admission.this service
1d 11h ago build pendingCodexCoder21Organization/AiCliSupervisorManagerServiceServerRemote run 584f76ae remains PENDING after 225299s of queue wait; waiting for buildtest admission.this service
1d 11h ago build pendingCodexCoder21Organization/AiCliSupervisorManagerServiceServerRemote run 8fd1b634 remains PENDING after 206696s of queue wait; waiting for buildtest admission.this service
1d 11h ago build pendingCodexCoder21Organization/AiCliSupervisorManagerServiceServerRemote run 584f76ae remains PENDING after 224997s of queue wait; waiting for buildtest admission.this service
1d 11h ago build pendingCodexCoder21Organization/AiCliSupervisorManagerServiceServerRemote run 0a16aa29 remains PENDING after 222360s of queue wait; waiting for buildtest admission.this service
1d 11h ago build pendingCodexCoder21Organization/AiCliSupervisorManagerServiceServerRemote run 8fd1b634 remains PENDING after 206356s of queue wait; waiting for buildtest admission.this service
1d 11h ago build pendingCodexCoder21Organization/AiCliSupervisorManagerServiceServerRemote run 584f76ae remains PENDING after 224662s of queue wait; waiting for buildtest admission.this service
1d 11h ago build pendingCodexCoder21Organization/AiCliSupervisorManagerServiceServerRemote run 0a16aa29 remains PENDING after 222024s of queue wait; waiting for buildtest admission.this service
1d 11h ago build remote stopCodexCoder21Organization/AiCliSupervisorManagerServiceServerRemote stop attempt 6 for check run 122962881975 failed: foundation.url.protocol.sandbox.SandboxException: Sandboxed code threw an exception: java.lang.InternalError: Exception encountered in implementation of foundation/url/sjvm/intrinsics/ServiceBridge:rpc(Ljava/lang/String;Ljava/util/Map;)Ljava/util/Map; : foundation.url.resolver.UrlResolutionException: RPC request 'supersedeBuildRun' failed: INTERNAL_ERROR - RPC error: INTERNAL_ERROR - Cannot supersede build run '1300c6e8': it is already in terminal status COMPLETED. Only in-progress builds can be superseded. cause: null. The cancellation stays saved; retrying in 1920000ms.this service
1d 11h ago build pendingCodexCoder21Organization/AiCliSupervisorManagerServiceServerRemote run 8fd1b634 remains PENDING after 206009s of queue wait; waiting for buildtest admission.this service
1d 11h ago build pendingCodexCoder21Organization/AiCliSupervisorManagerServiceServerRemote run 584f76ae remains PENDING after 224362s of queue wait; waiting for buildtest admission.this service
1d 11h ago build pendingCodexCoder21Organization/AiCliSupervisorManagerServiceServerRemote run 0a16aa29 remains PENDING after 221702s of queue wait; waiting for buildtest admission.this service
1d 11h ago build pendingCodexCoder21Organization/AiCliSupervisorManagerServiceServerRemote run 0a16aa29 remains PENDING after 221399s of queue wait; waiting for buildtest admission.this service
1d 11h ago build pendingCodexCoder21Organization/AiCliSupervisorManagerServiceServerRemote run 584f76ae remains PENDING after 223910s of queue wait; waiting for buildtest admission.this service
1d 11h ago build pendingCodexCoder21Organization/AiCliSupervisorManagerServiceServerRemote run 8fd1b634 remains PENDING after 205496s of queue wait; waiting for buildtest admission.this service
1d 11h ago deliveryCodexCoder21Organization/AiCliSupervisorManagerServiceServerGitHub delivered check_suite.completed for CodexCoder21Organization/AiCliSupervisorManagerServiceServer.codexcoder21
1d 11h ago deliveryCodexCoder21Organization/AiCliSupervisorManagerServiceServerGitHub delivered check_run.completed for CodexCoder21Organization/AiCliSupervisorManagerServiceServer.codexcoder21
1d 11h ago completedCodexCoder21Organization/AiCliSupervisorManagerServiceServerBuild failed: 66 passed, 1 failed, 67 totalthis service
1d 11h ago build pendingCodexCoder21Organization/AiCliSupervisorManagerServiceServerRemote run 0a16aa29 remains PENDING after 220995s of queue wait; waiting for buildtest admission.this service
1d 11h ago build pendingCodexCoder21Organization/AiCliSupervisorManagerServiceServerRemote run 8fd1b634 remains PENDING after 205155s of queue wait; waiting for buildtest admission.this service
1d 11h ago build pendingCodexCoder21Organization/AiCliSupervisorManagerServiceServerRemote run 584f76ae remains PENDING after 223506s of queue wait; waiting for buildtest admission.this service
1d 11h ago build pendingCodexCoder21Organization/AiCliSupervisorManagerServiceServerRemote run 0a16aa29 remains PENDING after 220649s of queue wait; waiting for buildtest admission.this service
1d 11h ago build pendingCodexCoder21Organization/AiCliSupervisorManagerServiceServerRemote run 584f76ae remains PENDING after 223199s of queue wait; waiting for buildtest admission.this service
1d 11h ago build pendingCodexCoder21Organization/AiCliSupervisorManagerServiceServerRemote run 8fd1b634 remains PENDING after 204829s of queue wait; waiting for buildtest admission.this service
1d 11h ago build pendingCodexCoder21Organization/AiCliSupervisorManagerServiceServerRemote run 0a16aa29 remains PENDING after 220335s of queue wait; waiting for buildtest admission.this service
1d 11h ago build pendingCodexCoder21Organization/AiCliSupervisorManagerServiceServerRemote run 584f76ae remains PENDING after 222871s of queue wait; waiting for buildtest admission.this service
1d 11h ago build pendingCodexCoder21Organization/AiCliSupervisorManagerServiceServerRemote run cae9cf2e remains PENDING after 228143s of queue wait; waiting for buildtest admission.this service
1d 11h ago build pendingCodexCoder21Organization/AiCliSupervisorManagerServiceServerRemote run 8fd1b634 remains PENDING after 204516s of queue wait; waiting for buildtest admission.this service
1d 11h ago deliveryCodexCoder21Organization/AiCliSupervisorManagerServiceServerGitHub delivered check_suite.completed for CodexCoder21Organization/AiCliSupervisorManagerServiceServer.codexcoder21
1d 11h ago deliveryCodexCoder21Organization/AiCliSupervisorManagerServiceServerGitHub delivered check_run.completed for CodexCoder21Organization/AiCliSupervisorManagerServiceServer.codexcoder21
1d 11h ago completedCodexCoder21Organization/AiCliSupervisorManagerServiceServerBuild never started because the runner was saturated: every build worker was already running a check. It waited 1s in the deferred queue before the existing local deferred-submission deadline expired.this service
1d 11h ago build pendingCodexCoder21Organization/AiCliSupervisorManagerServiceServerRemote run 0a16aa29 remains PENDING after 219999s of queue wait; waiting for buildtest admission.this service
1d 11h ago build pendingCodexCoder21Organization/AiCliSupervisorManagerServiceServerRemote run 8fd1b634 remains PENDING after 204206s of queue wait; waiting for buildtest admission.this service
1d 11h ago build pendingCodexCoder21Organization/AiCliSupervisorManagerServiceServerRemote run 584f76ae remains PENDING after 222546s of queue wait; waiting for buildtest admission.this service
1d 11h ago build pendingCodexCoder21Organization/AiCliSupervisorManagerServiceServerRemote run cae9cf2e remains PENDING after 227816s of queue wait; waiting for buildtest admission.this service
1d 11h ago deliveryCodexCoder21Organization/AiCliSupervisorManagerServiceServerGitHub delivered check_run.completed for CodexCoder21Organization/AiCliSupervisorManagerServiceServer.codexcoder21
1d 11h ago deliveryCodexCoder21Organization/AiCliSupervisorManagerServiceServerGitHub delivered check_suite.completed for CodexCoder21Organization/AiCliSupervisorManagerServiceServer.codexcoder21
1d 11h ago completedCodexCoder21Organization/AiCliSupervisorManagerServiceServerBuild never started because the runner was saturated: every build worker was already running a check. It waited 2s in the deferred queue before the existing local deferred-submission deadline expired.this service
1d 11h ago deliveryCodexCoder21Organization/AiCliSupervisorManagerServiceServerGitHub delivered check_suite.completed for CodexCoder21Organization/AiCliSupervisorManagerServiceServer.codexcoder21
1d 11h ago deliveryCodexCoder21Organization/AiCliSupervisorManagerServiceServerGitHub delivered check_run.completed for CodexCoder21Organization/AiCliSupervisorManagerServiceServer.codexcoder21
1d 11h ago completedCodexCoder21Organization/AiCliSupervisorManagerServiceServerBuild never started because the runner was saturated: every build worker was already running a check. It waited 1s in the deferred queue before the existing local deferred-submission deadline expired.this service
1d 11h ago build pendingCodexCoder21Organization/AiCliSupervisorManagerServiceServerRemote run 0a16aa29 remains PENDING after 219652s of queue wait; waiting for buildtest admission.this service
1d 11h ago deliveryCodexCoder21Organization/AiCliSupervisorManagerServiceServerGitHub delivered check_run.completed for CodexCoder21Organization/AiCliSupervisorManagerServiceServer.codexcoder21
1d 11h ago deliveryCodexCoder21Organization/AiCliSupervisorManagerServiceServerGitHub delivered check_suite.completed for CodexCoder21Organization/AiCliSupervisorManagerServiceServer.codexcoder21
1d 11h ago completedCodexCoder21Organization/AiCliSupervisorManagerServiceServerBuild never started because the runner was saturated: every build worker was already running a check. It waited 0s in the deferred queue before the existing local deferred-submission deadline expired.this service
1d 11h ago build pendingCodexCoder21Organization/AiCliSupervisorManagerServiceServerRemote run 8fd1b634 remains PENDING after 203890s of queue wait; waiting for buildtest admission.this service
1d 11h ago build pendingCodexCoder21Organization/AiCliSupervisorManagerServiceServerRemote run cae9cf2e remains PENDING after 227512s of queue wait; waiting for buildtest admission.this service
1d 11h ago build pendingCodexCoder21Organization/AiCliSupervisorManagerServiceServerRemote run 584f76ae remains PENDING after 222227s of queue wait; waiting for buildtest admission.this service
1d 11h ago deliveryCodexCoder21Organization/AiCliSupervisorManagerServiceServerGitHub delivered check_run.completed for CodexCoder21Organization/AiCliSupervisorManagerServiceServer.codexcoder21
1d 11h ago deliveryCodexCoder21Organization/AiCliSupervisorManagerServiceServerGitHub delivered check_suite.completed for CodexCoder21Organization/AiCliSupervisorManagerServiceServer.codexcoder21
1d 11h ago completedCodexCoder21Organization/AiCliSupervisorManagerServiceServerBuild never started because the runner was saturated: every build worker was already running a check. It waited 5s in the deferred queue before the existing local deferred-submission deadline expired.this service
1d 11h ago deliveryCodexCoder21Organization/AiCliSupervisorManagerServiceServerGitHub delivered check_run.completed for CodexCoder21Organization/AiCliSupervisorManagerServiceServer.codexcoder21
1d 11h ago completedCodexCoder21Organization/AiCliSupervisorManagerServiceServerBuild never started because the runner was saturated: every build worker was already running a check. It waited 2s in the deferred queue before the existing local deferred-submission deadline expired.this service
1d 11h ago build pendingCodexCoder21Organization/AiCliSupervisorManagerServiceServerRemote run 0a16aa29 remains PENDING after 219338s of queue wait; waiting for buildtest admission.this service
1d 11h ago deliveryCodexCoder21Organization/AiCliSupervisorManagerServiceServerGitHub delivered check_suite.completed for CodexCoder21Organization/AiCliSupervisorManagerServiceServer.codexcoder21
1d 11h ago deliveryCodexCoder21Organization/AiCliSupervisorManagerServiceServerGitHub delivered check_run.completed for CodexCoder21Organization/AiCliSupervisorManagerServiceServer.codexcoder21
1d 11h ago completedCodexCoder21Organization/AiCliSupervisorManagerServiceServerBuild never started because the runner was saturated: every build worker was already running a check. It waited 2s in the deferred queue before the existing local deferred-submission deadline expired.this service
1d 12h ago build pendingCodexCoder21Organization/AiCliSupervisorManagerServiceServerRemote run 584f76ae remains PENDING after 221915s of queue wait; waiting for buildtest admission.this service
1d 12h ago build pendingCodexCoder21Organization/AiCliSupervisorManagerServiceServerRemote run 8fd1b634 remains PENDING after 203561s of queue wait; waiting for buildtest admission.this service
1d 12h ago build pendingCodexCoder21Organization/AiCliSupervisorManagerServiceServerRemote run cae9cf2e remains PENDING after 227183s of queue wait; waiting for buildtest admission.this service
1d 12h ago build remote stopCodexCoder21Organization/AiCliSupervisorManagerServiceServerRemote stop attempt 5 for check run 122962881975 failed: foundation.url.protocol.sandbox.SandboxException: Sandboxed code threw an exception: java.lang.InternalError: Exception encountered in implementation of foundation/url/sjvm/intrinsics/ServiceBridge:rpc(Ljava/lang/String;Ljava/util/Map;)Ljava/util/Map; : foundation.url.resolver.UrlResolutionException: RPC request 'supersedeBuildRun' failed: INTERNAL_ERROR - RPC error: INTERNAL_ERROR - Cannot supersede build run '1300c6e8': it is already in terminal status COMPLETED. Only in-progress builds can be superseded. cause: null. The cancellation stays saved; retrying in 960000ms.this service
1d 12h ago deliveryCodexCoder21Organization/AiCliSupervisorManagerServiceServerGitHub delivered check_run.completed for CodexCoder21Organization/AiCliSupervisorManagerServiceServer.codexcoder21
1d 12h ago completedCodexCoder21Organization/AiCliSupervisorManagerServiceServerBuild never started because the runner was saturated: every build worker was already running a check. It waited 1s in the deferred queue before the existing local deferred-submission deadline expired.this service
1d 12h ago build pendingCodexCoder21Organization/AiCliSupervisorManagerServiceServerRemote run 0a16aa29 remains PENDING after 218996s of queue wait; waiting for buildtest admission.this service
1d 12h ago build pendingCodexCoder21Organization/AiCliSupervisorManagerServiceServerRemote run 584f76ae remains PENDING after 221584s of queue wait; waiting for buildtest admission.this service
1d 12h ago build pendingCodexCoder21Organization/AiCliSupervisorManagerServiceServerRemote run cae9cf2e remains PENDING after 226843s of queue wait; waiting for buildtest admission.this service
1d 12h ago deliveryCodexCoder21Organization/AiCliSupervisorManagerServiceServerGitHub delivered check_run.completed for CodexCoder21Organization/AiCliSupervisorManagerServiceServer.codexcoder21
1d 12h ago build alignment deferredCodexCoder21Organization/AiCliSupervisorManagerServiceServerCheck run 123012610919 is tracked and its tracked lifecycle has no active remote run yet, so the sweep left it to that path.this service
1d 12h ago completedCodexCoder21Organization/AiCliSupervisorManagerServiceServerBuild never started because the runner was saturated: every build worker was already running a check. It waited 131s in the deferred queue before the existing local deferred-submission deadline expired.this service
1d 12h ago deliveryCodexCoder21Organization/AiCliSupervisorManagerServiceServerGitHub delivered check_run.completed for CodexCoder21Organization/AiCliSupervisorManagerServiceServer.codexcoder21
1d 12h ago completedCodexCoder21Organization/AiCliSupervisorManagerServiceServerBuild never started because the runner was saturated: every build worker was already running a check. It waited 7s in the deferred queue before the existing local deferred-submission deadline expired.this service
1d 12h ago deliveryCodexCoder21Organization/AiCliSupervisorManagerServiceServerGitHub delivered check_run.completed for CodexCoder21Organization/AiCliSupervisorManagerServiceServer.codexcoder21
1d 12h ago completedCodexCoder21Organization/AiCliSupervisorManagerServiceServerBuild never started because the runner was saturated: every build worker was already running a check. It waited 7s in the deferred queue before the existing local deferred-submission deadline expired.this service
1d 12h ago deliveryCodexCoder21Organization/AiCliSupervisorManagerServiceServerGitHub delivered check_suite.completed for CodexCoder21Organization/AiCliSupervisorManagerServiceServer.codexcoder21
1d 12h ago deliveryCodexCoder21Organization/AiCliSupervisorManagerServiceServerGitHub delivered check_run.completed for CodexCoder21Organization/AiCliSupervisorManagerServiceServer.codexcoder21
1d 12h ago completedCodexCoder21Organization/AiCliSupervisorManagerServiceServerBuild never started because the runner was saturated: every build worker was already running a check. It waited 11s in the deferred queue before the existing local deferred-submission deadline expired.this service
1d 12h ago deliveryCodexCoder21Organization/AiCliSupervisorManagerServiceServerGitHub delivered check_suite.completed for CodexCoder21Organization/AiCliSupervisorManagerServiceServer.codexcoder21
1d 12h ago deliveryCodexCoder21Organization/AiCliSupervisorManagerServiceServerGitHub delivered check_run.completed for CodexCoder21Organization/AiCliSupervisorManagerServiceServer.codexcoder21
1d 12h ago completedCodexCoder21Organization/AiCliSupervisorManagerServiceServerBuild never started because the runner was saturated: every build worker was already running a check. It waited 9s in the deferred queue before the existing local deferred-submission deadline expired.this service
1d 12h ago deliveryCodexCoder21Organization/AiCliSupervisorManagerServiceServerGitHub delivered check_run.completed for CodexCoder21Organization/AiCliSupervisorManagerServiceServer.codexcoder21
1d 12h ago deliveryCodexCoder21Organization/AiCliSupervisorManagerServiceServerGitHub delivered check_suite.completed for CodexCoder21Organization/AiCliSupervisorManagerServiceServer.codexcoder21