kotlin.build CI

Trigger log

Every delivery GitHub sent and what this service did with it — including the ones that produced no build. Newest first.

WhenWhatRepositoryDetailWho
11s ago build pendingCodexCoder21Organization/BuildTestProjectionJournalRemote run e8be8aed remains PENDING after 1s of queue wait; waiting for buildtest admission.this service
10s ago deliveryCodexCoder21Organization/BuildTestProjectionJournalGitHub delivered check_run.created for CodexCoder21Organization/BuildTestProjectionJournal.codexcoder21
10s ago deliveryCodexCoder21Organization/BuildTestProjectionJournalGitHub delivered check_run.completed for CodexCoder21Organization/BuildTestProjectionJournal.codexcoder21
11s ago deliveryCodexCoder21Organization/BuildTestProjectionJournalGitHub delivered check_run.created for CodexCoder21Organization/BuildTestProjectionJournal.codexcoder21
12s ago dispatchedCodexCoder21Organization/BuildTestProjectionJournalSubmitted to the direct-buildtest build service.this service
13s ago completedCodexCoder21Organization/BuildTestProjectionJournalPR #104 was closed, canceling the in-flight build for this pull request.this service
14s ago deliveryCodexCoder21Organization/BuildTestProjectionJournalGitHub delivered check_suite.requested for CodexCoder21Organization/BuildTestProjectionJournal.codexcoder21
14s ago deliveryCodexCoder21Organization/BuildTestProjectionJournalGitHub delivered push for CodexCoder21Organization/BuildTestProjectionJournal.codexcoder21
14s ago cancelledCodexCoder21Organization/BuildTestProjectionJournalPull request #104 was closed, so stopping its in-flight build was requested and continues in the background.this service
14s ago deliveryCodexCoder21Organization/BuildTestProjectionJournalGitHub delivered pull_request.closed for CodexCoder21Organization/BuildTestProjectionJournal.codexcoder21
20s ago deliveryCodexCoder21Organization/BuildTestProjectionJournalGitHub delivered check_run.created for CodexCoder21Organization/BuildTestProjectionJournal.codexcoder21
21s ago deliveryCodexCoder21Organization/BuildTestProjectionJournalGitHub delivered check_run.created for CodexCoder21Organization/BuildTestProjectionJournal.codexcoder21
22s ago dispatchedCodexCoder21Organization/BuildTestProjectionJournalSubmitted to the direct-buildtest build service.this service
23s ago deliveryCodexCoder21Organization/BuildTestProjectionJournalGitHub delivered check_run.created for CodexCoder21Organization/BuildTestProjectionJournal.codexcoder21
23s ago deliveryCodexCoder21Organization/BuildTestProjectionJournalGitHub delivered pull_request.opened for CodexCoder21Organization/BuildTestProjectionJournal.codexcoder21
25s ago deliveryCodexCoder21Organization/BuildTestProjectionJournalGitHub delivered check_suite.requested for CodexCoder21Organization/BuildTestProjectionJournal.codexcoder21
26s ago deliveryCodexCoder21Organization/BuildTestProjectionJournalGitHub delivered push for CodexCoder21Organization/BuildTestProjectionJournal.codexcoder21
51s ago deliveryCodexCoder21Organization/BuildTestProjectionJournalGitHub delivered check_run.completed for CodexCoder21Organization/BuildTestProjectionJournal.github-merge-queue[bot]
1m 25s ago build pendingCodexCoder21Organization/BuildTestProjectionJournalRemote run 3e45fde6 remains PENDING after 30s of queue wait; waiting for buildtest admission.this service
1m 37s ago skippedCodexCoder21Organization/BuildTestProjectionJournalThe non-PR branch 'wip/fix97-lockorder1-evidence' uses the wip/ checkpoint prefix, so this check_suite request started no build.this service
1m 37s ago deliveryCodexCoder21Organization/BuildTestProjectionJournalGitHub delivered check_suite.requested for CodexCoder21Organization/BuildTestProjectionJournal.codexcoder21
1m 37s ago deliveryCodexCoder21Organization/BuildTestProjectionJournalGitHub delivered push for CodexCoder21Organization/BuildTestProjectionJournal.codexcoder21
1m 47s ago deliveryCodexCoder21Organization/BuildTestProjectionJournalGitHub delivered check_run.completed for CodexCoder21Organization/BuildTestProjectionJournal.codexcoder21
1m 51s ago deliveryCodexCoder21Organization/BuildTestProjectionJournalGitHub delivered check_run.created for CodexCoder21Organization/BuildTestProjectionJournal.github-merge-queue[bot]
1m 56s ago dispatchedCodexCoder21Organization/BuildTestProjectionJournalSubmitted to the direct-buildtest build service.this service
1m 59s ago deliveryCodexCoder21Organization/BuildTestProjectionJournalGitHub delivered check_run.created for CodexCoder21Organization/BuildTestProjectionJournal.github-merge-queue[bot]
2m 0s ago deliveryCodexCoder21Organization/BuildTestProjectionJournalGitHub delivered check_run.created for CodexCoder21Organization/BuildTestProjectionJournal.github-merge-queue[bot]
2m 1s ago deliveryCodexCoder21Organization/BuildTestProjectionJournalGitHub delivered check_suite.requested for CodexCoder21Organization/BuildTestProjectionJournal.github-merge-queue[bot]
2m 2s ago deliveryCodexCoder21Organization/BuildTestProjectionJournalGitHub delivered push for CodexCoder21Organization/BuildTestProjectionJournal.github-merge-queue[bot]
2m 27s ago build pendingCodexCoder21Organization/BuildTestProjectionJournalRemote run 1fa56305 remains PENDING after 2s of queue wait; waiting for buildtest admission.this service
2m 19s ago deliveryCodexCoder21Organization/BuildTestProjectionJournalGitHub delivered pull_request.enqueued for CodexCoder21Organization/BuildTestProjectionJournal.codexcoder21
2m 23s ago deliveryCodexCoder21Organization/BuildTestProjectionJournalGitHub delivered pull_request.ready_for_review for CodexCoder21Organization/BuildTestProjectionJournal.codexcoder21
2m 27s ago deliveryCodexCoder21Organization/BuildTestProjectionJournalGitHub delivered check_run.created for CodexCoder21Organization/BuildTestProjectionJournal.codexcoder21
2m 28s ago deliveryCodexCoder21Organization/BuildTestProjectionJournalGitHub delivered check_run.created for CodexCoder21Organization/BuildTestProjectionJournal.codexcoder21
2m 29s ago dispatchedCodexCoder21Organization/BuildTestProjectionJournalSubmitted to the direct-buildtest build service.this service
2m 30s ago deliveryCodexCoder21Organization/BuildTestProjectionJournalGitHub delivered check_suite.requested for CodexCoder21Organization/BuildTestProjectionJournal.codexcoder21
2m 30s ago deliveryCodexCoder21Organization/BuildTestProjectionJournalGitHub delivered push for CodexCoder21Organization/BuildTestProjectionJournal.codexcoder21
2m 31s ago deliveryCodexCoder21Organization/BuildTestProjectionJournalGitHub delivered pull_request.closed for CodexCoder21Organization/BuildTestProjectionJournal.codexcoder21
2m 34s ago deliveryCodexCoder21Organization/BuildTestProjectionJournalGitHub delivered pull_request.ready_for_review for CodexCoder21Organization/BuildTestProjectionJournal.codexcoder21
4m 38s ago skippedCodexCoder21Organization/BuildTestProjectionJournalThe non-PR branch 'wip/fix97-lockorder1-evidence' uses the wip/ checkpoint prefix, so this check_suite request started no build.this service
4m 38s ago deliveryCodexCoder21Organization/BuildTestProjectionJournalGitHub delivered check_suite.requested for CodexCoder21Organization/BuildTestProjectionJournal.codexcoder21
4m 38s ago deliveryCodexCoder21Organization/BuildTestProjectionJournalGitHub delivered push for CodexCoder21Organization/BuildTestProjectionJournal.codexcoder21
6m 20s ago deliveryCodexCoder21Organization/BuildTestProjectionJournalGitHub delivered check_suite.completed for CodexCoder21Organization/BuildTestProjectionJournal.github-merge-queue[bot]
6m 20s ago deliveryCodexCoder21Organization/BuildTestProjectionJournalGitHub delivered check_run.completed for CodexCoder21Organization/BuildTestProjectionJournal.github-merge-queue[bot]
9m 12s ago build remote stopCodexCoder21Organization/BuildTestProjectionJournalRemote stop attempt 178 for check run 120374520850 failed: foundation.url.protocol.sandbox.SandboxException: Sandboxed code threw an exception: java.lang.InternalError: Exception encountered in implementation of foundation/url/sjvm/intrinsics/ServiceBridge:rpc(Ljava/lang/String;Ljava/util/Map;)Ljava/util/Map; : foundation.url.resolver.UrlResolutionException: RPC request 'supersedeBuildRun' failed: RELAY_ERROR - Handler error: RPC error: INTERNAL_ERROR - Cannot supersede build run '31e5555b': it is already in terminal status FAILED. Only in-progress builds can be superseded. cause: null. The cancellation stays saved; retrying in 1920000ms.this service
13m 37s ago skippedCodexCoder21Organization/BuildTestProjectionJournalThe non-PR branch 'wip/fix97-lockorder1-evidence' uses the wip/ checkpoint prefix, so this check_suite request started no build.this service
13m 37s ago deliveryCodexCoder21Organization/BuildTestProjectionJournalGitHub delivered check_suite.requested for CodexCoder21Organization/BuildTestProjectionJournal.codexcoder21
13m 38s ago deliveryCodexCoder21Organization/BuildTestProjectionJournalGitHub delivered push for CodexCoder21Organization/BuildTestProjectionJournal.codexcoder21
13m 38s ago build remote stopCodexCoder21Organization/BuildTestProjectionJournalRemote stop attempt 10 for check run 123904636467 failed: foundation.url.protocol.sandbox.SandboxException: Sandboxed code threw an exception: java.lang.InternalError: Exception encountered in implementation of foundation/url/sjvm/intrinsics/ServiceBridge:rpc(Ljava/lang/String;Ljava/util/Map;)Ljava/util/Map; : foundation.url.resolver.UrlResolutionException: RPC request 'supersedeBuildRun' failed: RELAY_ERROR - Handler error: RPC error: INTERNAL_ERROR - Cannot supersede build run 'd1923e44': it is already in terminal status CANCELED. Only in-progress builds can be superseded. cause: null. The cancellation stays saved; retrying in 1920000ms.this service
16m 30s ago skippedCodexCoder21Organization/BuildTestProjectionJournalThe non-PR branch 'wip/fix97-lockorder1-evidence' uses the wip/ checkpoint prefix, so this check_suite request started no build.this service
16m 30s ago deliveryCodexCoder21Organization/BuildTestProjectionJournalGitHub delivered check_suite.requested for CodexCoder21Organization/BuildTestProjectionJournal.codexcoder21
16m 31s ago deliveryCodexCoder21Organization/BuildTestProjectionJournalGitHub delivered push for CodexCoder21Organization/BuildTestProjectionJournal.codexcoder21
16m 33s ago deliveryCodexCoder21Organization/BuildTestProjectionJournalGitHub delivered check_run.completed for CodexCoder21Organization/BuildTestProjectionJournal.github-merge-queue[bot]
16m 34s ago deliveryCodexCoder21Organization/BuildTestProjectionJournalGitHub delivered check_suite.completed for CodexCoder21Organization/BuildTestProjectionJournal.github-merge-queue[bot]
16m 36s ago completedCodexCoder21Organization/BuildTestProjectionJournalAll tests passing (619/619)this service
19m 48s ago build remote stopCodexCoder21Organization/BuildTestProjectionJournalRemote stop attempt 10 for check run 124391777713 failed: foundation.url.protocol.sandbox.SandboxException: Sandboxed code threw an exception: java.lang.InternalError: Exception encountered in implementation of foundation/url/sjvm/intrinsics/ServiceBridge:rpc(Ljava/lang/String;Ljava/util/Map;)Ljava/util/Map; : foundation.url.resolver.UrlResolutionException: RPC request 'supersedeBuildRun' failed: RELAY_ERROR - Handler error: RPC error: INTERNAL_ERROR - Cannot supersede build run 'baaf20ed': it is already in terminal status FAILED. Only in-progress builds can be superseded. cause: null. The cancellation stays saved; retrying in 1920000ms.this service
23m 51s ago build remote stopCodexCoder21Organization/BuildTestProjectionJournalRemote stop attempt 11 for check run 124131574870 failed: foundation.url.protocol.sandbox.SandboxException: Sandboxed code threw an exception: java.lang.InternalError: Exception encountered in implementation of foundation/url/sjvm/intrinsics/ServiceBridge:rpc(Ljava/lang/String;Ljava/util/Map;)Ljava/util/Map; : foundation.url.resolver.UrlResolutionException: RPC request 'supersedeBuildRun' failed: RELAY_ERROR - Handler error: RPC error: INTERNAL_ERROR - Cannot supersede build run '01ead0a1': it is already in terminal status FAILED. Only in-progress builds can be superseded. cause: null. The cancellation stays saved; retrying in 1920000ms.this service
24m 20s ago build remote stopCodexCoder21Organization/BuildTestProjectionJournalRemote stop attempt 10 for check run 123219567311 failed: foundation.url.protocol.sandbox.SandboxException: Sandboxed code threw an exception: java.lang.InternalError: Exception encountered in implementation of foundation/url/sjvm/intrinsics/ServiceBridge:rpc(Ljava/lang/String;Ljava/util/Map;)Ljava/util/Map; : foundation.url.resolver.UrlResolutionException: RPC request 'supersedeBuildRun' failed: RELAY_ERROR - Handler error: RPC error: INTERNAL_ERROR - Cannot supersede build run '76090d0f': it is already in terminal status FAILED. Only in-progress builds can be superseded. cause: null. The cancellation stays saved; retrying in 1920000ms.this service
24m 43s ago deliveryCodexCoder21Organization/BuildTestProjectionJournalGitHub delivered check_run.completed for CodexCoder21Organization/BuildTestProjectionJournal.github-merge-queue[bot]
25m 2s ago build pendingCodexCoder21Organization/BuildTestProjectionJournalRemote run a5bb7748 remains PENDING after 22s of queue wait; waiting for buildtest admission.this service
24m 57s ago skippedCodexCoder21Organization/BuildTestProjectionJournalThe non-PR branch 'wip/fix97-lockorder1-evidence' uses the wip/ checkpoint prefix, so this check_suite request started no build.this service
24m 57s ago deliveryCodexCoder21Organization/BuildTestProjectionJournalGitHub delivered check_suite.requested for CodexCoder21Organization/BuildTestProjectionJournal.codexcoder21
24m 58s ago deliveryCodexCoder21Organization/BuildTestProjectionJournalGitHub delivered push for CodexCoder21Organization/BuildTestProjectionJournal.codexcoder21
25m 2s ago skippedCodexCoder21Organization/BuildTestProjectionJournalThe non-PR branch 'wip/fix97-lockorder1-ckpt' uses the wip/ checkpoint prefix, so this check_suite request started no build.this service
25m 2s ago deliveryCodexCoder21Organization/BuildTestProjectionJournalGitHub delivered check_suite.requested for CodexCoder21Organization/BuildTestProjectionJournal.codexcoder21
25m 3s ago deliveryCodexCoder21Organization/BuildTestProjectionJournalGitHub delivered push for CodexCoder21Organization/BuildTestProjectionJournal.codexcoder21
25m 23s ago deliveryCodexCoder21Organization/BuildTestProjectionJournalGitHub delivered check_run.created for CodexCoder21Organization/BuildTestProjectionJournal.github-merge-queue[bot]
25m 23s ago deliveryCodexCoder21Organization/BuildTestProjectionJournalGitHub delivered check_run.created for CodexCoder21Organization/BuildTestProjectionJournal.github-merge-queue[bot]
25m 24s ago deliveryCodexCoder21Organization/BuildTestProjectionJournalGitHub delivered check_run.created for CodexCoder21Organization/BuildTestProjectionJournal.github-merge-queue[bot]
25m 24s ago deliveryCodexCoder21Organization/BuildTestProjectionJournalGitHub delivered pull_request.dequeued for CodexCoder21Organization/BuildTestProjectionJournal.codexcoder21
25m 24s ago deliveryCodexCoder21Organization/BuildTestProjectionJournalGitHub delivered pull_request.closed for CodexCoder21Organization/BuildTestProjectionJournal.codexcoder21
25m 25s ago deliveryCodexCoder21Organization/BuildTestProjectionJournalGitHub delivered push for CodexCoder21Organization/BuildTestProjectionJournal.github-merge-queue[bot]
25m 25s ago dispatchedCodexCoder21Organization/BuildTestProjectionJournalPush to main submitted to the direct-buildtest build service.this service
25m 26s ago deliveryCodexCoder21Organization/BuildTestProjectionJournalGitHub delivered push for CodexCoder21Organization/BuildTestProjectionJournal.github-merge-queue[bot]
25m 39s ago build remote stopCodexCoder21Organization/BuildTestProjectionJournalRemote stop attempt 159 for check run 120509268570 failed: foundation.url.protocol.sandbox.SandboxException: Sandboxed code threw an exception: java.lang.InternalError: Exception encountered in implementation of foundation/url/sjvm/intrinsics/ServiceBridge:rpc(Ljava/lang/String;Ljava/util/Map;)Ljava/util/Map; : foundation.url.resolver.UrlResolutionException: RPC request 'supersedeBuildRun' failed: RELAY_ERROR - Handler error: RPC error: INTERNAL_ERROR - Cannot supersede build run '77d8f7a6': it is already in terminal status FAILED. Only in-progress builds can be superseded. cause: null. The cancellation stays saved; retrying in 1920000ms.this service
25m 44s ago deliveryCodexCoder21Organization/BuildTestProjectionJournalGitHub delivered check_suite.completed for CodexCoder21Organization/BuildTestProjectionJournal.github-merge-queue[bot]
25m 44s ago deliveryCodexCoder21Organization/BuildTestProjectionJournalGitHub delivered check_run.completed for CodexCoder21Organization/BuildTestProjectionJournal.github-merge-queue[bot]
27m 9s ago deliveryCodexCoder21Organization/BuildTestProjectionJournalGitHub delivered check_run.completed for CodexCoder21Organization/BuildTestProjectionJournal.github-merge-queue[bot]
27m 9s ago deliveryCodexCoder21Organization/BuildTestProjectionJournalGitHub delivered check_suite.completed for CodexCoder21Organization/BuildTestProjectionJournal.github-merge-queue[bot]
27m 12s ago completedCodexCoder21Organization/BuildTestProjectionJournalAll tests passing (619/619)this service
27m 38s ago build remote stopCodexCoder21Organization/BuildTestProjectionJournalRemote stop attempt 24 for check run 122342779831 failed: foundation.url.protocol.sandbox.SandboxException: Sandboxed code threw an exception: java.lang.InternalError: Exception encountered in implementation of foundation/url/sjvm/intrinsics/ServiceBridge:rpc(Ljava/lang/String;Ljava/util/Map;)Ljava/util/Map; : foundation.url.resolver.UrlResolutionException: RPC request 'supersedeBuildRun' failed: RELAY_ERROR - Handler error: RPC error: INTERNAL_ERROR - Cannot supersede build run '36c72f65': it is already in terminal status FAILED. Only in-progress builds can be superseded. cause: null. The cancellation stays saved; retrying in 1920000ms.this service
31m 47s ago build remote stopCodexCoder21Organization/BuildTestProjectionJournalRemote stop attempt 11 for check run 124282946036 failed: foundation.url.protocol.sandbox.SandboxException: Sandboxed code threw an exception: java.lang.InternalError: Exception encountered in implementation of foundation/url/sjvm/intrinsics/ServiceBridge:rpc(Ljava/lang/String;Ljava/util/Map;)Ljava/util/Map; : foundation.url.resolver.UrlResolutionException: RPC request 'supersedeBuildRun' failed: RELAY_ERROR - Handler error: RPC error: INTERNAL_ERROR - Cannot supersede build run '58b8c6b0': it is already in terminal status CANCELED. Only in-progress builds can be superseded. cause: null. The cancellation stays saved; retrying in 1920000ms.this service
32m 50s ago skippedCodexCoder21Organization/BuildTestProjectionJournalThe non-PR branch 'wip/fix97-lockorder1-evidence' uses the wip/ checkpoint prefix, so this check_suite request started no build.this service
32m 50s ago deliveryCodexCoder21Organization/BuildTestProjectionJournalGitHub delivered check_suite.requested for CodexCoder21Organization/BuildTestProjectionJournal.codexcoder21
32m 50s ago deliveryCodexCoder21Organization/BuildTestProjectionJournalGitHub delivered push for CodexCoder21Organization/BuildTestProjectionJournal.codexcoder21
33m 45s ago deliveryCodexCoder21Organization/BuildTestProjectionJournalGitHub delivered check_suite.completed for CodexCoder21Organization/BuildTestProjectionJournal.codexcoder21
33m 45s ago deliveryCodexCoder21Organization/BuildTestProjectionJournalGitHub delivered check_run.completed for CodexCoder21Organization/BuildTestProjectionJournal.codexcoder21
34m 26s ago build remote stopCodexCoder21Organization/BuildTestProjectionJournalRemote stop attempt 15 for check run 123920497196 failed: foundation.url.protocol.sandbox.SandboxException: Sandboxed code threw an exception: java.lang.InternalError: Exception encountered in implementation of foundation/url/sjvm/intrinsics/ServiceBridge:rpc(Ljava/lang/String;Ljava/util/Map;)Ljava/util/Map; : foundation.url.resolver.UrlResolutionException: RPC request 'supersedeBuildRun' failed: RELAY_ERROR - Handler error: RPC error: INTERNAL_ERROR - Cannot supersede build run '07fd652e': it is already in terminal status FAILED. Only in-progress builds can be superseded. cause: null. The cancellation stays saved; retrying in 1920000ms.this service
35m 59s ago skippedCodexCoder21Organization/BuildTestProjectionJournalThe non-PR branch 'wip/fix97-lockorder1-ckpt' uses the wip/ checkpoint prefix, so this check_suite request started no build.this service
35m 59s ago deliveryCodexCoder21Organization/BuildTestProjectionJournalGitHub delivered check_suite.requested for CodexCoder21Organization/BuildTestProjectionJournal.codexcoder21
36m 0s ago deliveryCodexCoder21Organization/BuildTestProjectionJournalGitHub delivered push for CodexCoder21Organization/BuildTestProjectionJournal.codexcoder21
36m 57s ago deliveryCodexCoder21Organization/BuildTestProjectionJournalGitHub delivered check_run.completed for CodexCoder21Organization/BuildTestProjectionJournal.codexcoder21
36m 57s ago deliveryCodexCoder21Organization/BuildTestProjectionJournalGitHub delivered check_suite.completed for CodexCoder21Organization/BuildTestProjectionJournal.codexcoder21
36m 59s ago completedCodexCoder21Organization/BuildTestProjectionJournalAll tests passing (594/594)this service
37m 31s ago build remote stopCodexCoder21Organization/BuildTestProjectionJournalRemote stop attempt 13 for check run 123918946157 failed: foundation.url.protocol.sandbox.SandboxException: Sandboxed code threw an exception: java.lang.InternalError: Exception encountered in implementation of foundation/url/sjvm/intrinsics/ServiceBridge:rpc(Ljava/lang/String;Ljava/util/Map;)Ljava/util/Map; : foundation.url.resolver.UrlResolutionException: RPC request 'supersedeBuildRun' failed: RELAY_ERROR - Handler error: RPC error: INTERNAL_ERROR - Cannot supersede build run '4512210c': it is already in terminal status FAILED. Only in-progress builds can be superseded. cause: null. The cancellation stays saved; retrying in 1920000ms.this service
41m 22s ago deliveryCodexCoder21Organization/BuildTestProjectionJournalGitHub delivered check_run.completed for CodexCoder21Organization/BuildTestProjectionJournal.codexcoder21
41m 22s ago deliveryCodexCoder21Organization/BuildTestProjectionJournalGitHub delivered check_suite.completed for CodexCoder21Organization/BuildTestProjectionJournal.codexcoder21
41m 23s ago completedCodexCoder21Organization/BuildTestProjectionJournalAll tests passing (259/259)this service
42m 43s ago deliveryCodexCoder21Organization/BuildTestProjectionJournalGitHub delivered check_run.completed for CodexCoder21Organization/BuildTestProjectionJournal.codexcoder21
42m 43s ago deliveryCodexCoder21Organization/BuildTestProjectionJournalGitHub delivered check_suite.completed for CodexCoder21Organization/BuildTestProjectionJournal.codexcoder21
42m 46s ago deliveryCodexCoder21Organization/BuildTestProjectionJournalGitHub delivered check_run.completed for CodexCoder21Organization/BuildTestProjectionJournal.github-merge-queue[bot]
43m 6s ago deliveryCodexCoder21Organization/BuildTestProjectionJournalGitHub delivered check_run.completed for CodexCoder21Organization/BuildTestProjectionJournal.codexcoder21
43m 6s ago deliveryCodexCoder21Organization/BuildTestProjectionJournalGitHub delivered check_suite.completed for CodexCoder21Organization/BuildTestProjectionJournal.codexcoder21
43m 9s ago completedCodexCoder21Organization/BuildTestProjectionJournalAll tests passing (291/291)this service
43m 37s ago build pendingCodexCoder21Organization/BuildTestProjectionJournalRemote run 49bcb16c remains PENDING after 13s of queue wait; waiting for buildtest admission.this service
43m 47s ago deliveryCodexCoder21Organization/BuildTestProjectionJournalGitHub delivered check_run.created for CodexCoder21Organization/BuildTestProjectionJournal.github-merge-queue[bot]
43m 50s ago dispatchedCodexCoder21Organization/BuildTestProjectionJournalSubmitted to the direct-buildtest build service.this service
43m 51s ago deliveryCodexCoder21Organization/BuildTestProjectionJournalGitHub delivered check_run.created for CodexCoder21Organization/BuildTestProjectionJournal.github-merge-queue[bot]
43m 52s ago deliveryCodexCoder21Organization/BuildTestProjectionJournalGitHub delivered check_run.created for CodexCoder21Organization/BuildTestProjectionJournal.github-merge-queue[bot]
43m 53s ago deliveryCodexCoder21Organization/BuildTestProjectionJournalGitHub delivered check_suite.requested for CodexCoder21Organization/BuildTestProjectionJournal.github-merge-queue[bot]
43m 55s ago deliveryCodexCoder21Organization/BuildTestProjectionJournalGitHub delivered push for CodexCoder21Organization/BuildTestProjectionJournal.github-merge-queue[bot]
44m 12s ago deliveryCodexCoder21Organization/BuildTestProjectionJournalGitHub delivered pull_request.enqueued for CodexCoder21Organization/BuildTestProjectionJournal.codexcoder21
44m 16s ago deliveryCodexCoder21Organization/BuildTestProjectionJournalGitHub delivered pull_request.ready_for_review for CodexCoder21Organization/BuildTestProjectionJournal.codexcoder21
44m 35s ago deliveryCodexCoder21Organization/BuildTestProjectionJournalGitHub delivered pull_request.edited for CodexCoder21Organization/BuildTestProjectionJournal.codexcoder21
44m 48s ago deliveryCodexCoder21Organization/BuildTestProjectionJournalGitHub delivered check_run.completed for CodexCoder21Organization/BuildTestProjectionJournal.codexcoder21
44m 48s ago deliveryCodexCoder21Organization/BuildTestProjectionJournalGitHub delivered check_suite.completed for CodexCoder21Organization/BuildTestProjectionJournal.codexcoder21
44m 59s ago skippedCodexCoder21Organization/BuildTestProjectionJournalThe non-PR branch 'wip/fix96-97-p2-evidence' uses the wip/ checkpoint prefix, so this check_suite request started no build.this service
44m 59s ago deliveryCodexCoder21Organization/BuildTestProjectionJournalGitHub delivered check_suite.requested for CodexCoder21Organization/BuildTestProjectionJournal.codexcoder21
45m 0s ago deliveryCodexCoder21Organization/BuildTestProjectionJournalGitHub delivered push for CodexCoder21Organization/BuildTestProjectionJournal.codexcoder21
45m 18s ago build remote stopCodexCoder21Organization/BuildTestProjectionJournalRemote stop attempt 14 for check run 123846602397 failed: foundation.url.protocol.sandbox.SandboxException: Sandboxed code threw an exception: java.lang.InternalError: Exception encountered in implementation of foundation/url/sjvm/intrinsics/ServiceBridge:rpc(Ljava/lang/String;Ljava/util/Map;)Ljava/util/Map; : foundation.url.resolver.UrlResolutionException: RPC request 'supersedeBuildRun' failed: RELAY_ERROR - Handler error: RPC error: INTERNAL_ERROR - Cannot supersede build run '5ad84146': it is already in terminal status COMPLETED. Only in-progress builds can be superseded. cause: null. The cancellation stays saved; retrying in 1920000ms.this service
45m 39s ago deliveryCodexCoder21Organization/BuildTestProjectionJournalGitHub delivered pull_request.edited for CodexCoder21Organization/BuildTestProjectionJournal.codexcoder21
46m 11s ago deliveryCodexCoder21Organization/BuildTestProjectionJournalGitHub delivered check_suite.completed for CodexCoder21Organization/BuildTestProjectionJournal.codexcoder21
46m 11s ago deliveryCodexCoder21Organization/BuildTestProjectionJournalGitHub delivered check_run.completed for CodexCoder21Organization/BuildTestProjectionJournal.codexcoder21
46m 32s ago skippedCodexCoder21Organization/BuildTestProjectionJournalThe non-PR branch 'wip/fix100-p6-ckpt' uses the wip/ checkpoint prefix, so this check_suite request started no build.this service
46m 32s ago deliveryCodexCoder21Organization/BuildTestProjectionJournalGitHub delivered check_suite.requested for CodexCoder21Organization/BuildTestProjectionJournal.codexcoder21
46m 33s ago deliveryCodexCoder21Organization/BuildTestProjectionJournalGitHub delivered push for CodexCoder21Organization/BuildTestProjectionJournal.codexcoder21
47m 31s ago deliveryCodexCoder21Organization/BuildTestProjectionJournalGitHub delivered push for CodexCoder21Organization/BuildTestProjectionJournal.codexcoder21
47m 32s ago skippedCodexCoder21Organization/BuildTestProjectionJournalThe non-PR branch 'wip/fix100-p6-evidence' uses the wip/ checkpoint prefix, so this check_suite request started no build.this service
47m 32s ago deliveryCodexCoder21Organization/BuildTestProjectionJournalGitHub delivered check_suite.requested for CodexCoder21Organization/BuildTestProjectionJournal.codexcoder21
48m 14s ago skippedCodexCoder21Organization/BuildTestProjectionJournalThe non-PR branch 'wip/journal-incomplete-baseline1-evidence' uses the wip/ checkpoint prefix, so this check_suite request started no build.this service
48m 14s ago deliveryCodexCoder21Organization/BuildTestProjectionJournalGitHub delivered check_suite.requested for CodexCoder21Organization/BuildTestProjectionJournal.codexcoder21
48m 15s ago deliveryCodexCoder21Organization/BuildTestProjectionJournalGitHub delivered push for CodexCoder21Organization/BuildTestProjectionJournal.codexcoder21
48m 34s ago skippedCodexCoder21Organization/BuildTestProjectionJournalThe non-PR branch 'wip/fix96-97-p2-evidence' uses the wip/ checkpoint prefix, so this check_suite request started no build.this service
48m 34s ago deliveryCodexCoder21Organization/BuildTestProjectionJournalGitHub delivered check_suite.requested for CodexCoder21Organization/BuildTestProjectionJournal.codexcoder21
48m 35s ago deliveryCodexCoder21Organization/BuildTestProjectionJournalGitHub delivered push for CodexCoder21Organization/BuildTestProjectionJournal.codexcoder21
49m 29s ago skippedCodexCoder21Organization/BuildTestProjectionJournalThe non-PR branch 'wip/fix99-p4-evidence' uses the wip/ checkpoint prefix, so this check_suite request started no build.this service
49m 29s ago deliveryCodexCoder21Organization/BuildTestProjectionJournalGitHub delivered check_suite.requested for CodexCoder21Organization/BuildTestProjectionJournal.codexcoder21
49m 30s ago deliveryCodexCoder21Organization/BuildTestProjectionJournalGitHub delivered push for CodexCoder21Organization/BuildTestProjectionJournal.codexcoder21
50m 0s ago deliveryCodexCoder21Organization/BuildTestProjectionJournalGitHub delivered check_suite.completed for CodexCoder21Organization/BuildTestProjectionJournal.codexcoder21
50m 0s ago deliveryCodexCoder21Organization/BuildTestProjectionJournalGitHub delivered check_run.completed for CodexCoder21Organization/BuildTestProjectionJournal.codexcoder21
50m 2s ago completedCodexCoder21Organization/BuildTestProjectionJournalAll tests passing (648/648)this service
51m 41s ago deliveryCodexCoder21Organization/BuildTestProjectionJournalGitHub delivered check_run.completed for CodexCoder21Organization/BuildTestProjectionJournal.codexcoder21
51m 45s ago deliveryCodexCoder21Organization/BuildTestProjectionJournalGitHub delivered check_run.created for CodexCoder21Organization/BuildTestProjectionJournal.codexcoder21
51m 49s ago deliveryCodexCoder21Organization/BuildTestProjectionJournalGitHub delivered pull_request.opened for CodexCoder21Organization/BuildTestProjectionJournal.codexcoder21
52m 12s ago skippedCodexCoder21Organization/BuildTestProjectionJournalThe non-PR branch 'wip/journal-incomplete-baseline1-evidence' uses the wip/ checkpoint prefix, so this check_suite request started no build.this service
52m 12s ago deliveryCodexCoder21Organization/BuildTestProjectionJournalGitHub delivered check_suite.requested for CodexCoder21Organization/BuildTestProjectionJournal.codexcoder21
52m 12s ago deliveryCodexCoder21Organization/BuildTestProjectionJournalGitHub delivered check_run.created for CodexCoder21Organization/BuildTestProjectionJournal.codexcoder21
52m 13s ago deliveryCodexCoder21Organization/BuildTestProjectionJournalGitHub delivered push for CodexCoder21Organization/BuildTestProjectionJournal.codexcoder21
52m 15s ago deliveryCodexCoder21Organization/BuildTestProjectionJournalGitHub delivered check_run.created for CodexCoder21Organization/BuildTestProjectionJournal.codexcoder21
52m 16s ago dispatchedCodexCoder21Organization/BuildTestProjectionJournalSubmitted to the direct-buildtest build service.this service
52m 17s ago deliveryCodexCoder21Organization/BuildTestProjectionJournalGitHub delivered check_suite.requested for CodexCoder21Organization/BuildTestProjectionJournal.codexcoder21
52m 18s ago deliveryCodexCoder21Organization/BuildTestProjectionJournalGitHub delivered push for CodexCoder21Organization/BuildTestProjectionJournal.codexcoder21
52m 36s ago deliveryCodexCoder21Organization/BuildTestProjectionJournalGitHub delivered pull_request.edited for CodexCoder21Organization/BuildTestProjectionJournal.codexcoder21
53m 19s ago skippedCodexCoder21Organization/BuildTestProjectionJournalThe non-PR branch 'wip/fix100-p6-evidence' uses the wip/ checkpoint prefix, so this check_suite request started no build.this service
53m 19s ago deliveryCodexCoder21Organization/BuildTestProjectionJournalGitHub delivered check_suite.requested for CodexCoder21Organization/BuildTestProjectionJournal.codexcoder21
53m 19s ago deliveryCodexCoder21Organization/BuildTestProjectionJournalGitHub delivered push for CodexCoder21Organization/BuildTestProjectionJournal.codexcoder21
53m 38s ago deliveryCodexCoder21Organization/BuildTestProjectionJournalGitHub delivered check_run.completed for CodexCoder21Organization/BuildTestProjectionJournal.codexcoder21
53m 40s ago skippedCodexCoder21Organization/BuildTestProjectionJournalThe non-PR branch 'wip/fix100-p6-ckpt' uses the wip/ checkpoint prefix, so this check_suite request started no build.this service
53m 40s ago deliveryCodexCoder21Organization/BuildTestProjectionJournalGitHub delivered check_suite.requested for CodexCoder21Organization/BuildTestProjectionJournal.codexcoder21
53m 41s ago deliveryCodexCoder21Organization/BuildTestProjectionJournalGitHub delivered push for CodexCoder21Organization/BuildTestProjectionJournal.codexcoder21
54m 19s ago build pendingCodexCoder21Organization/BuildTestProjectionJournalRemote run 73fcd3ec remains PENDING after 5s of queue wait; waiting for buildtest admission.this service
54m 14s ago skippedCodexCoder21Organization/BuildTestProjectionJournalThe non-PR branch 'wip/fix96-97-p2-evidence' uses the wip/ checkpoint prefix, so this check_suite request started no build.this service
54m 14s ago deliveryCodexCoder21Organization/BuildTestProjectionJournalGitHub delivered check_suite.requested for CodexCoder21Organization/BuildTestProjectionJournal.codexcoder21
54m 15s ago deliveryCodexCoder21Organization/BuildTestProjectionJournalGitHub delivered push for CodexCoder21Organization/BuildTestProjectionJournal.codexcoder21
54m 23s ago deliveryCodexCoder21Organization/BuildTestProjectionJournalGitHub delivered check_run.created for CodexCoder21Organization/BuildTestProjectionJournal.codexcoder21
54m 24s ago deliveryCodexCoder21Organization/BuildTestProjectionJournalGitHub delivered check_run.created for CodexCoder21Organization/BuildTestProjectionJournal.codexcoder21
54m 25s ago build remote stopCodexCoder21Organization/BuildTestProjectionJournalRemote stop attempt 10 for check run 124131574870 failed: foundation.url.protocol.sandbox.SandboxException: Sandboxed code threw an exception: java.lang.InternalError: Exception encountered in implementation of foundation/url/sjvm/intrinsics/ServiceBridge:rpc(Ljava/lang/String;Ljava/util/Map;)Ljava/util/Map; : foundation.url.resolver.UrlResolutionException: RPC request 'supersedeBuildRun' failed: RELAY_ERROR - Handler error: RPC error: INTERNAL_ERROR - Cannot supersede build run '01ead0a1': it is already in terminal status FAILED. Only in-progress builds can be superseded. cause: null. The cancellation stays saved; retrying in 1920000ms.this service
54m 25s ago build remote stopCodexCoder21Organization/BuildTestProjectionJournalRemote stop attempt 10 for check run 124282946036 failed: foundation.url.protocol.sandbox.SandboxException: Sandboxed code threw an exception: java.lang.InternalError: Exception encountered in implementation of foundation/url/sjvm/intrinsics/ServiceBridge:rpc(Ljava/lang/String;Ljava/util/Map;)Ljava/util/Map; : foundation.url.resolver.UrlResolutionException: RPC request 'supersedeBuildRun' failed: RELAY_ERROR - Handler error: RPC error: INTERNAL_ERROR - Cannot supersede build run '58b8c6b0': it is already in terminal status CANCELED. Only in-progress builds can be superseded. cause: null. The cancellation stays saved; retrying in 1920000ms.this service
54m 25s ago dispatchedCodexCoder21Organization/BuildTestProjectionJournalSubmitted to the direct-buildtest build service.this service
54m 28s ago deliveryCodexCoder21Organization/BuildTestProjectionJournalGitHub delivered check_run.created for CodexCoder21Organization/BuildTestProjectionJournal.codexcoder21
54m 28s ago deliveryCodexCoder21Organization/BuildTestProjectionJournalGitHub delivered pull_request.synchronize for CodexCoder21Organization/BuildTestProjectionJournal.codexcoder21
54m 29s ago deliveryCodexCoder21Organization/BuildTestProjectionJournalGitHub delivered check_suite.requested for CodexCoder21Organization/BuildTestProjectionJournal.codexcoder21
54m 30s ago deliveryCodexCoder21Organization/BuildTestProjectionJournalGitHub delivered push for CodexCoder21Organization/BuildTestProjectionJournal.codexcoder21
56m 28s ago deliveryCodexCoder21Organization/BuildTestProjectionJournalGitHub delivered check_run.completed for CodexCoder21Organization/BuildTestProjectionJournal.codexcoder21
56m 36s ago build remote stopCodexCoder21Organization/BuildTestProjectionJournalRemote stop attempt 177 for check run 120374520850 failed: foundation.url.protocol.sandbox.SandboxException: Sandboxed code threw an exception: java.lang.InternalError: Exception encountered in implementation of foundation/url/sjvm/intrinsics/ServiceBridge:rpc(Ljava/lang/String;Ljava/util/Map;)Ljava/util/Map; : foundation.url.resolver.UrlResolutionException: RPC request 'supersedeBuildRun' failed: RELAY_ERROR - Handler error: RPC error: INTERNAL_ERROR - Cannot supersede build run '31e5555b': it is already in terminal status FAILED. Only in-progress builds can be superseded. cause: null. The cancellation stays saved; retrying in 1920000ms.this service
57m 1s ago build pendingCodexCoder21Organization/BuildTestProjectionJournalRemote run dd857635 remains PENDING after 3s of queue wait; waiting for buildtest admission.this service
57m 2s ago deliveryCodexCoder21Organization/BuildTestProjectionJournalGitHub delivered check_run.created for CodexCoder21Organization/BuildTestProjectionJournal.codexcoder21
57m 2s ago deliveryCodexCoder21Organization/BuildTestProjectionJournalGitHub delivered check_run.created for CodexCoder21Organization/BuildTestProjectionJournal.codexcoder21
57m 5s ago dispatchedCodexCoder21Organization/BuildTestProjectionJournalSubmitted to the direct-buildtest build service.this service
57m 5s ago deliveryCodexCoder21Organization/BuildTestProjectionJournalGitHub delivered pull_request.edited for CodexCoder21Organization/BuildTestProjectionJournal.codexcoder21
57m 5s ago deliveryCodexCoder21Organization/BuildTestProjectionJournalGitHub delivered check_run.created for CodexCoder21Organization/BuildTestProjectionJournal.codexcoder21
57m 6s ago build remote stopCodexCoder21Organization/BuildTestProjectionJournalRemote stop attempt 13 for check run 123846602397 failed: foundation.url.protocol.sandbox.SandboxException: Sandboxed code threw an exception: java.lang.InternalError: Exception encountered in implementation of foundation/url/sjvm/intrinsics/ServiceBridge:rpc(Ljava/lang/String;Ljava/util/Map;)Ljava/util/Map; : foundation.url.resolver.UrlResolutionException: RPC request 'supersedeBuildRun' failed: RELAY_ERROR - Handler error: RPC error: INTERNAL_ERROR - Cannot supersede build run '5ad84146': it is already in terminal status COMPLETED. Only in-progress builds can be superseded. cause: null. The cancellation stays saved; retrying in 1920000ms.this service
57m 6s ago build remote stopCodexCoder21Organization/BuildTestProjectionJournalRemote stop attempt 12 for check run 123918946157 failed: foundation.url.protocol.sandbox.SandboxException: Sandboxed code threw an exception: java.lang.InternalError: Exception encountered in implementation of foundation/url/sjvm/intrinsics/ServiceBridge:rpc(Ljava/lang/String;Ljava/util/Map;)Ljava/util/Map; : foundation.url.resolver.UrlResolutionException: RPC request 'supersedeBuildRun' failed: RELAY_ERROR - Handler error: RPC error: INTERNAL_ERROR - Cannot supersede build run '4512210c': it is already in terminal status FAILED. Only in-progress builds can be superseded. cause: null. The cancellation stays saved; retrying in 1920000ms.this service
57m 6s ago deliveryCodexCoder21Organization/BuildTestProjectionJournalGitHub delivered pull_request.synchronize for CodexCoder21Organization/BuildTestProjectionJournal.codexcoder21
57m 7s ago deliveryCodexCoder21Organization/BuildTestProjectionJournalGitHub delivered check_suite.requested for CodexCoder21Organization/BuildTestProjectionJournal.codexcoder21
57m 8s ago deliveryCodexCoder21Organization/BuildTestProjectionJournalGitHub delivered push for CodexCoder21Organization/BuildTestProjectionJournal.codexcoder21
1h 2m ago deliveryCodexCoder21Organization/BuildTestProjectionJournalGitHub delivered check_run.completed for CodexCoder21Organization/BuildTestProjectionJournal.codexcoder21
1h 3m ago build pendingCodexCoder21Organization/BuildTestProjectionJournalRemote run dabf37c1 remains PENDING after 8s of queue wait; waiting for buildtest admission.this service
1h 3m ago deliveryCodexCoder21Organization/BuildTestProjectionJournalGitHub delivered check_run.created for CodexCoder21Organization/BuildTestProjectionJournal.codexcoder21
1h 3m ago build remote stopCodexCoder21Organization/BuildTestProjectionJournalRemote stop attempt 14 for check run 123920497196 failed: foundation.url.protocol.sandbox.SandboxException: Sandboxed code threw an exception: java.lang.InternalError: Exception encountered in implementation of foundation/url/sjvm/intrinsics/ServiceBridge:rpc(Ljava/lang/String;Ljava/util/Map;)Ljava/util/Map; : foundation.url.resolver.UrlResolutionException: RPC request 'supersedeBuildRun' failed: RELAY_ERROR - Handler error: RPC error: INTERNAL_ERROR - Cannot supersede build run '07fd652e': it is already in terminal status FAILED. Only in-progress builds can be superseded. cause: null. The cancellation stays saved; retrying in 1920000ms.this service
1h 3m ago build remote stopCodexCoder21Organization/BuildTestProjectionJournalRemote stop attempt 9 for check run 124391777713 failed: foundation.url.protocol.sandbox.SandboxException: Sandboxed code threw an exception: java.lang.InternalError: Exception encountered in implementation of foundation/url/sjvm/intrinsics/ServiceBridge:rpc(Ljava/lang/String;Ljava/util/Map;)Ljava/util/Map; : foundation.url.resolver.UrlResolutionException: RPC request 'supersedeBuildRun' failed: RELAY_ERROR - Handler error: RPC error: INTERNAL_ERROR - Cannot supersede build run 'baaf20ed': it is already in terminal status FAILED. Only in-progress builds can be superseded. cause: null. The cancellation stays saved; retrying in 1920000ms.this service
1h 3m ago dispatchedCodexCoder21Organization/BuildTestProjectionJournalSubmitted to the direct-buildtest build service.this service
1h 3m ago deliveryCodexCoder21Organization/BuildTestProjectionJournalGitHub delivered check_run.created for CodexCoder21Organization/BuildTestProjectionJournal.codexcoder21
1h 4m ago deliveryCodexCoder21Organization/BuildTestProjectionJournalGitHub delivered check_run.created for CodexCoder21Organization/BuildTestProjectionJournal.codexcoder21
1h 4m ago deliveryCodexCoder21Organization/BuildTestProjectionJournalGitHub delivered pull_request.edited for CodexCoder21Organization/BuildTestProjectionJournal.codexcoder21
1h 4m ago deliveryCodexCoder21Organization/BuildTestProjectionJournalGitHub delivered pull_request.synchronize for CodexCoder21Organization/BuildTestProjectionJournal.codexcoder21
1h 4m ago deliveryCodexCoder21Organization/BuildTestProjectionJournalGitHub delivered check_suite.requested for CodexCoder21Organization/BuildTestProjectionJournal.codexcoder21
1h 4m ago deliveryCodexCoder21Organization/BuildTestProjectionJournalGitHub delivered push for CodexCoder21Organization/BuildTestProjectionJournal.codexcoder21
1h 4m ago deliveryCodexCoder21Organization/BuildTestProjectionJournalGitHub delivered check_suite.completed for CodexCoder21Organization/BuildTestProjectionJournal.codexcoder21
1h 4m ago deliveryCodexCoder21Organization/BuildTestProjectionJournalGitHub delivered check_run.completed for CodexCoder21Organization/BuildTestProjectionJournal.codexcoder21