Trigger log
Every delivery GitHub sent and what this service did with it — including the ones that produced no build. Newest first.
| When | What | Repository | Detail | Who |
|---|---|---|---|---|
| build remote stop | CodexCoder21Organization/ContainerNursery | Remote stop attempt 22 for check run 123189389727 failed: foundation.url.protocol.sandbox.SandboxException: Sandboxed code threw an exception: java.lang.InternalError: Exception encountered in implementation of foundation/url/sjvm/intrinsics/ServiceBridge:rpc(Ljava/lang/String;Ljava/util/Map;)Ljava/util/Map; : foundation.url.resolver.UrlResolutionException: RPC request 'supersedeBuildRun' failed: RELAY_ERROR - Handler error: RPC error: INTERNAL_ERROR - Cannot supersede build run 'f4a3ed31': it is already in terminal status FAILED. Only in-progress builds can be superseded. cause: null. The cancellation stays saved; retrying in 1920000ms. | this service | |
| build remote stop | CodexCoder21Organization/ContainerNursery | Remote stop attempt 18 for check run 123207798433 failed: foundation.url.protocol.sandbox.SandboxException: Sandboxed code threw an exception: java.lang.InternalError: Exception encountered in implementation of foundation/url/sjvm/intrinsics/ServiceBridge:rpc(Ljava/lang/String;Ljava/util/Map;)Ljava/util/Map; : foundation.url.resolver.UrlResolutionException: RPC request 'supersedeBuildRun' failed: RELAY_ERROR - Handler error: RPC error: INTERNAL_ERROR - Cannot supersede build run '450dd0a5': it is already in terminal status FAILED. Only in-progress builds can be superseded. cause: null. The cancellation stays saved; retrying in 1920000ms. | this service | |
| build remote stop | CodexCoder21Organization/ContainerNursery | Remote stop attempt 13 for check run 122894390167 failed: foundation.url.protocol.sandbox.SandboxException: Sandboxed code threw an exception: java.lang.InternalError: Exception encountered in implementation of foundation/url/sjvm/intrinsics/ServiceBridge:rpc(Ljava/lang/String;Ljava/util/Map;)Ljava/util/Map; : foundation.url.resolver.UrlResolutionException: RPC request 'supersedeBuildRun' failed: RELAY_ERROR - Handler error: RPC error: INTERNAL_ERROR - Cannot supersede build run '23e82d63': it is already in terminal status FAILED. Only in-progress builds can be superseded. cause: null. The cancellation stays saved; retrying in 1920000ms. | this service | |
| build remote stop | CodexCoder21Organization/ContainerNursery | Remote stop attempt 11 for check run 123710719080 failed: foundation.url.protocol.sandbox.SandboxException: Sandboxed code threw an exception: java.lang.InternalError: Exception encountered in implementation of foundation/url/sjvm/intrinsics/ServiceBridge:rpc(Ljava/lang/String;Ljava/util/Map;)Ljava/util/Map; : foundation.url.resolver.UrlResolutionException: RPC request 'supersedeBuildRun' failed: RELAY_ERROR - Handler error: RPC error: INTERNAL_ERROR - Cannot supersede build run '78027f97': it is already in terminal status FAILED. Only in-progress builds can be superseded. cause: null. The cancellation stays saved; retrying in 1920000ms. | this service | |
| build remote stop | CodexCoder21Organization/ContainerNursery | Remote stop attempt 10 for check run 123811865446 failed: foundation.url.protocol.sandbox.SandboxException: Sandboxed code threw an exception: java.lang.InternalError: Exception encountered in implementation of foundation/url/sjvm/intrinsics/ServiceBridge:rpc(Ljava/lang/String;Ljava/util/Map;)Ljava/util/Map; : foundation.url.resolver.UrlResolutionException: RPC request 'supersedeBuildRun' failed: RELAY_ERROR - Handler error: RPC error: INTERNAL_ERROR - Cannot supersede build run '2d2142ba': it is already in terminal status FAILED. Only in-progress builds can be superseded. cause: null. The cancellation stays saved; retrying in 1920000ms. | this service | |
| build recovery failed | CodexCoder21Organization/ContainerNursery | Failed to recover shadow check 118990623554: foundation.url.protocol.sandbox.SandboxException: Sandboxed code threw an exception: java.lang.InternalError: Exception encountered in implementation of foundation/url/sjvm/intrinsics/ServiceBridge:rpc(Ljava/lang/String;Ljava/util/Map;)Ljava/util/Map; : foundation.url.resolver.UrlResolutionException: RPC request 'finalizeUpload' failed: INTERNAL_ERROR - RPC error: -1 - IllegalStateException: Cannot run CI operation 'finalizeUpload' because the url://buildtest/ connection has not been established, and it did not come up within 20000ms of waiting. Retry once the server logs 'url://buildtest/ connection established; ingestion and CI orchestration enabled.' cause: null at foundation.url.resolver.sandbox.TypeMarshaling.fromJvmResult$foundation_url_resolver_sandbox(TypeMarshaling.kt:692) at foundation.url.resolver.sandbox.InstanceMethodDispatcher$invokeWithActivity$3.invoke(SandboxedProxyGenerator.kt:2106) at foundation.url.resolver.sandbox.InstanceMethodDispatcher$invokeWithActivity$3.invoke(SandboxedProxyGenerator.kt:2037) at foundation.url.resolver.sandbox.SandboxedProxyGeneratorKt$invokeSandboxMethod$future$1$result$1.invoke(SandboxedProxyGenerator.kt:1491) at community.kotlin.clocks.hierarchical.RequiredClockPadKt.withRequiredClockPad(RequiredClockPad.kt:89) at foundation.url.resolver.sandbox.SandboxedProxyGeneratorKt.invokeSandboxMethod$lambda$4(SandboxedProxyGenerator.kt:1491) at java.base/java.util.concurrent.FutureTask.run(FutureTask.java:317) at foundation.url.resolver.sandbox.SandboxInvocationLane.runScheduled(SandboxedProxyGenerator.kt:1379) at foundation.url.resolver.sandbox.SandboxInvocationLane.schedule$lambda$5(SandboxedProxyGenerator.kt:1370) at java.base/java.util.concurrent.ThreadPoolExecutor.runWorker(ThreadPoolExecutor.java:1144) at java.base/java.util.concurrent.ThreadPoolExecutor$Worker.run(ThreadPoolExecutor.java:642) at java.base/java.lang.Thread.run(Thread.java:1583) Caused by: java.lang.RuntimeException: java.lang.InternalError: Exception encountered in implementation of foundation/url/sjvm/intrinsics/ServiceBridge:rpc(Ljava/lang/String;Ljava/util/Map;)Ljava/util/Map; : foundation.url.resolver.UrlResolutionException: RPC request 'finalizeUpload' failed: INTERNAL_ERROR - RPC error: -1 - IllegalStateException: Cannot run CI operation 'finalizeUpload' because the url://buildtest/ connection has not been established, and it did not come up within 20000ms of waiting. Retry once the server logs 'url://buildtest/ connection established; ingestion and CI orchestration enabled.' at foundation.url.resolver.sandbox.TypeMarshaling.fromJvmResult$foundation_url_resolver_sandbox(TypeMarshaling.kt:695) ... 11 more | this service | |
| build remote stop | CodexCoder21Organization/ContainerNursery | Remote stop attempt 17 for check run 123207798433 failed: foundation.url.protocol.sandbox.SandboxException: Sandboxed code threw an exception: java.lang.InternalError: Exception encountered in implementation of foundation/url/sjvm/intrinsics/ServiceBridge:rpc(Ljava/lang/String;Ljava/util/Map;)Ljava/util/Map; : foundation.url.resolver.UrlResolutionException: RPC request 'supersedeBuildRun' failed: RELAY_ERROR - Handler error: RPC error: INTERNAL_ERROR - Cannot supersede build run '450dd0a5': it is already in terminal status FAILED. Only in-progress builds can be superseded. cause: null. The cancellation stays saved; retrying in 1920000ms. | this service | |
| build remote stop | CodexCoder21Organization/ContainerNursery | Remote stop attempt 21 for check run 123189389727 failed: foundation.url.protocol.sandbox.SandboxException: Sandboxed code threw an exception: java.lang.InternalError: Exception encountered in implementation of foundation/url/sjvm/intrinsics/ServiceBridge:rpc(Ljava/lang/String;Ljava/util/Map;)Ljava/util/Map; : foundation.url.resolver.UrlResolutionException: RPC request 'supersedeBuildRun' failed: RELAY_ERROR - Handler error: RPC error: INTERNAL_ERROR - Cannot supersede build run 'f4a3ed31': it is already in terminal status FAILED. Only in-progress builds can be superseded. cause: null. The cancellation stays saved; retrying in 1920000ms. | this service | |
| build remote stop | CodexCoder21Organization/ContainerNursery | Remote stop attempt 12 for check run 122894390167 failed: foundation.url.protocol.sandbox.SandboxException: Sandboxed code threw an exception: java.lang.InternalError: Exception encountered in implementation of foundation/url/sjvm/intrinsics/ServiceBridge:rpc(Ljava/lang/String;Ljava/util/Map;)Ljava/util/Map; : foundation.url.resolver.UrlResolutionException: RPC request 'supersedeBuildRun' failed: RELAY_ERROR - Handler error: RPC error: INTERNAL_ERROR - Cannot supersede build run '23e82d63': it is already in terminal status FAILED. Only in-progress builds can be superseded. cause: null. The cancellation stays saved; retrying in 1920000ms. | this service | |
| build remote stop | CodexCoder21Organization/ContainerNursery | Remote stop attempt 10 for check run 123710719080 failed: foundation.url.protocol.sandbox.SandboxException: Sandboxed code threw an exception: java.lang.InternalError: Exception encountered in implementation of foundation/url/sjvm/intrinsics/ServiceBridge:rpc(Ljava/lang/String;Ljava/util/Map;)Ljava/util/Map; : foundation.url.resolver.UrlResolutionException: RPC request 'supersedeBuildRun' failed: RELAY_ERROR - Handler error: RPC error: INTERNAL_ERROR - Cannot supersede build run '78027f97': it is already in terminal status FAILED. Only in-progress builds can be superseded. cause: null. The cancellation stays saved; retrying in 1920000ms. | this service | |
| build remote stop | CodexCoder21Organization/ContainerNursery | Remote stop attempt 9 for check run 123811865446 failed: foundation.url.protocol.sandbox.SandboxException: Sandboxed code threw an exception: java.lang.InternalError: Exception encountered in implementation of foundation/url/sjvm/intrinsics/ServiceBridge:rpc(Ljava/lang/String;Ljava/util/Map;)Ljava/util/Map; : foundation.url.resolver.UrlResolutionException: RPC request 'supersedeBuildRun' failed: RELAY_ERROR - Handler error: RPC error: INTERNAL_ERROR - Cannot supersede build run '2d2142ba': it is already in terminal status FAILED. Only in-progress builds can be superseded. cause: null. The cancellation stays saved; retrying in 1920000ms. | this service | |
| build remote stop | CodexCoder21Organization/ContainerNursery | Remote stop attempt 16 for check run 123207798433 failed: foundation.url.protocol.sandbox.SandboxException: Sandboxed code threw an exception: java.lang.InternalError: Exception encountered in implementation of foundation/url/sjvm/intrinsics/ServiceBridge:rpc(Ljava/lang/String;Ljava/util/Map;)Ljava/util/Map; : foundation.url.resolver.UrlResolutionException: RPC request 'supersedeBuildRun' failed: RELAY_ERROR - Handler error: RPC error: INTERNAL_ERROR - Cannot supersede build run '450dd0a5': it is already in terminal status FAILED. Only in-progress builds can be superseded. cause: null. The cancellation stays saved; retrying in 1920000ms. | this service | |
| build remote stop | CodexCoder21Organization/ContainerNursery | Remote stop attempt 20 for check run 123189389727 failed: foundation.url.protocol.sandbox.SandboxException: Sandboxed code threw an exception: java.lang.InternalError: Exception encountered in implementation of foundation/url/sjvm/intrinsics/ServiceBridge:rpc(Ljava/lang/String;Ljava/util/Map;)Ljava/util/Map; : foundation.url.resolver.UrlResolutionException: RPC request 'supersedeBuildRun' failed: RELAY_ERROR - Handler error: RPC error: INTERNAL_ERROR - Cannot supersede build run 'f4a3ed31': it is already in terminal status FAILED. Only in-progress builds can be superseded. cause: null. The cancellation stays saved; retrying in 1920000ms. | this service | |
| build recovery failed | CodexCoder21Organization/ContainerNursery | Failed to recover shadow check 118728510417: foundation.url.protocol.sandbox.SandboxException: Sandboxed code threw an exception: java.lang.InternalError: Exception encountered in implementation of foundation/url/sjvm/intrinsics/ServiceBridge:rpc(Ljava/lang/String;Ljava/util/Map;)Ljava/util/Map; : foundation.url.resolver.UrlResolutionException: RPC request 'finalizeUpload' failed: INTERNAL_ERROR - RPC error: -1 - IllegalStateException: Cannot run CI operation 'finalizeUpload' because the url://buildtest/ connection has not been established, and it did not come up within 20000ms of waiting. Retry once the server logs 'url://buildtest/ connection established; ingestion and CI orchestration enabled.' cause: null at foundation.url.resolver.sandbox.TypeMarshaling.fromJvmResult$foundation_url_resolver_sandbox(TypeMarshaling.kt:692) at foundation.url.resolver.sandbox.InstanceMethodDispatcher$invokeWithActivity$3.invoke(SandboxedProxyGenerator.kt:2106) at foundation.url.resolver.sandbox.InstanceMethodDispatcher$invokeWithActivity$3.invoke(SandboxedProxyGenerator.kt:2037) at foundation.url.resolver.sandbox.SandboxedProxyGeneratorKt$invokeSandboxMethod$future$1$result$1.invoke(SandboxedProxyGenerator.kt:1491) at community.kotlin.clocks.hierarchical.RequiredClockPadKt.withRequiredClockPad(RequiredClockPad.kt:89) at foundation.url.resolver.sandbox.SandboxedProxyGeneratorKt.invokeSandboxMethod$lambda$4(SandboxedProxyGenerator.kt:1491) at java.base/java.util.concurrent.FutureTask.run(FutureTask.java:317) at foundation.url.resolver.sandbox.SandboxInvocationLane.runScheduled(SandboxedProxyGenerator.kt:1379) at foundation.url.resolver.sandbox.SandboxInvocationLane.schedule$lambda$5(SandboxedProxyGenerator.kt:1370) at java.base/java.util.concurrent.ThreadPoolExecutor.runWorker(ThreadPoolExecutor.java:1144) at java.base/java.util.concurrent.ThreadPoolExecutor$Worker.run(ThreadPoolExecutor.java:642) at java.base/java.lang.Thread.run(Thread.java:1583) Caused by: java.lang.RuntimeException: java.lang.InternalError: Exception encountered in implementation of foundation/url/sjvm/intrinsics/ServiceBridge:rpc(Ljava/lang/String;Ljava/util/Map;)Ljava/util/Map; : foundation.url.resolver.UrlResolutionException: RPC request 'finalizeUpload' failed: INTERNAL_ERROR - RPC error: -1 - IllegalStateException: Cannot run CI operation 'finalizeUpload' because the url://buildtest/ connection has not been established, and it did not come up within 20000ms of waiting. Retry once the server logs 'url://buildtest/ connection established; ingestion and CI orchestration enabled.' at foundation.url.resolver.sandbox.TypeMarshaling.fromJvmResult$foundation_url_resolver_sandbox(TypeMarshaling.kt:695) ... 11 more | this service | |
| build recovery failed | CodexCoder21Organization/ContainerNursery | Failed to recover shadow check 118717072152: foundation.url.protocol.sandbox.SandboxException: Sandboxed code threw an exception: java.lang.InternalError: Exception encountered in implementation of foundation/url/sjvm/intrinsics/ServiceBridge:rpc(Ljava/lang/String;Ljava/util/Map;)Ljava/util/Map; : foundation.url.resolver.UrlResolutionException: RPC request 'finalizeUpload' failed: INTERNAL_ERROR - RPC error: -1 - IllegalStateException: Cannot run CI operation 'finalizeUpload' because the url://buildtest/ connection has not been established, and it did not come up within 20000ms of waiting. Retry once the server logs 'url://buildtest/ connection established; ingestion and CI orchestration enabled.' cause: null at foundation.url.resolver.sandbox.TypeMarshaling.fromJvmResult$foundation_url_resolver_sandbox(TypeMarshaling.kt:692) at foundation.url.resolver.sandbox.InstanceMethodDispatcher$invokeWithActivity$3.invoke(SandboxedProxyGenerator.kt:2106) at foundation.url.resolver.sandbox.InstanceMethodDispatcher$invokeWithActivity$3.invoke(SandboxedProxyGenerator.kt:2037) at foundation.url.resolver.sandbox.SandboxedProxyGeneratorKt$invokeSandboxMethod$future$1$result$1.invoke(SandboxedProxyGenerator.kt:1491) at community.kotlin.clocks.hierarchical.RequiredClockPadKt.withRequiredClockPad(RequiredClockPad.kt:89) at foundation.url.resolver.sandbox.SandboxedProxyGeneratorKt.invokeSandboxMethod$lambda$4(SandboxedProxyGenerator.kt:1491) at java.base/java.util.concurrent.FutureTask.run(FutureTask.java:317) at foundation.url.resolver.sandbox.SandboxInvocationLane.runScheduled(SandboxedProxyGenerator.kt:1379) at foundation.url.resolver.sandbox.SandboxInvocationLane.schedule$lambda$5(SandboxedProxyGenerator.kt:1370) at java.base/java.util.concurrent.ThreadPoolExecutor.runWorker(ThreadPoolExecutor.java:1144) at java.base/java.util.concurrent.ThreadPoolExecutor$Worker.run(ThreadPoolExecutor.java:642) at java.base/java.lang.Thread.run(Thread.java:1583) Caused by: java.lang.RuntimeException: java.lang.InternalError: Exception encountered in implementation of foundation/url/sjvm/intrinsics/ServiceBridge:rpc(Ljava/lang/String;Ljava/util/Map;)Ljava/util/Map; : foundation.url.resolver.UrlResolutionException: RPC request 'finalizeUpload' failed: INTERNAL_ERROR - RPC error: -1 - IllegalStateException: Cannot run CI operation 'finalizeUpload' because the url://buildtest/ connection has not been established, and it did not come up within 20000ms of waiting. Retry once the server logs 'url://buildtest/ connection established; ingestion and CI orchestration enabled.' at foundation.url.resolver.sandbox.TypeMarshaling.fromJvmResult$foundation_url_resolver_sandbox(TypeMarshaling.kt:695) ... 11 more | this service | |
| build remote stop | CodexCoder21Organization/ContainerNursery | Remote stop attempt 11 for check run 122894390167 failed: foundation.url.protocol.sandbox.SandboxException: Sandboxed code threw an exception: java.lang.InternalError: Exception encountered in implementation of foundation/url/sjvm/intrinsics/ServiceBridge:rpc(Ljava/lang/String;Ljava/util/Map;)Ljava/util/Map; : foundation.url.resolver.UrlResolutionException: RPC request 'supersedeBuildRun' failed: RELAY_ERROR - Handler error: RPC error: INTERNAL_ERROR - Cannot supersede build run '23e82d63': it is already in terminal status FAILED. Only in-progress builds can be superseded. cause: null. The cancellation stays saved; retrying in 1920000ms. | this service | |
| build remote stop | CodexCoder21Organization/ContainerNursery | Remote stop attempt 9 for check run 123710719080 failed: foundation.url.protocol.sandbox.SandboxException: Sandboxed code threw an exception: java.lang.InternalError: Exception encountered in implementation of foundation/url/sjvm/intrinsics/ServiceBridge:rpc(Ljava/lang/String;Ljava/util/Map;)Ljava/util/Map; : foundation.url.resolver.UrlResolutionException: RPC request 'supersedeBuildRun' failed: RELAY_ERROR - Handler error: RPC error: INTERNAL_ERROR - Cannot supersede build run '78027f97': it is already in terminal status FAILED. Only in-progress builds can be superseded. cause: null. The cancellation stays saved; retrying in 1920000ms. | this service | |
| build remote stop | CodexCoder21Organization/ContainerNursery | Remote stop attempt 8 for check run 123811865446 failed: foundation.url.protocol.sandbox.SandboxException: Sandboxed code threw an exception: java.lang.InternalError: Exception encountered in implementation of foundation/url/sjvm/intrinsics/ServiceBridge:rpc(Ljava/lang/String;Ljava/util/Map;)Ljava/util/Map; : foundation.url.resolver.UrlResolutionException: RPC request 'supersedeBuildRun' failed: RELAY_ERROR - Handler error: RPC error: INTERNAL_ERROR - Cannot supersede build run '2d2142ba': it is already in terminal status FAILED. Only in-progress builds can be superseded. cause: null. The cancellation stays saved; retrying in 1920000ms. | this service | |
| build remote stop | CodexCoder21Organization/ContainerNursery | Remote stop attempt 15 for check run 123207798433 failed: foundation.url.protocol.sandbox.SandboxException: Sandboxed code threw an exception: java.lang.InternalError: Exception encountered in implementation of foundation/url/sjvm/intrinsics/ServiceBridge:rpc(Ljava/lang/String;Ljava/util/Map;)Ljava/util/Map; : foundation.url.resolver.UrlResolutionException: RPC request 'supersedeBuildRun' failed: RELAY_ERROR - Handler error: RPC error: INTERNAL_ERROR - Cannot supersede build run '450dd0a5': it is already in terminal status FAILED. Only in-progress builds can be superseded. cause: null. The cancellation stays saved; retrying in 1920000ms. | this service | |
| build remote stop | CodexCoder21Organization/ContainerNursery | Remote stop attempt 19 for check run 123189389727 failed: foundation.url.protocol.sandbox.SandboxException: Sandboxed code threw an exception: java.lang.InternalError: Exception encountered in implementation of foundation/url/sjvm/intrinsics/ServiceBridge:rpc(Ljava/lang/String;Ljava/util/Map;)Ljava/util/Map; : foundation.url.resolver.UrlResolutionException: RPC request 'supersedeBuildRun' failed: RELAY_ERROR - Handler error: RPC error: INTERNAL_ERROR - Cannot supersede build run 'f4a3ed31': it is already in terminal status FAILED. Only in-progress builds can be superseded. cause: null. The cancellation stays saved; retrying in 1920000ms. | this service | |
| build recovery failed | CodexCoder21Organization/ContainerNursery | Failed to recover shadow check 118455290603: foundation.url.protocol.sandbox.SandboxException: Sandboxed code threw an exception: java.lang.InternalError: Exception encountered in implementation of foundation/url/sjvm/intrinsics/ServiceBridge:rpc(Ljava/lang/String;Ljava/util/Map;)Ljava/util/Map; : foundation.url.resolver.UrlResolutionException: RPC request 'finalizeUpload' failed: INTERNAL_ERROR - RPC error: -1 - IllegalStateException: Cannot run CI operation 'finalizeUpload' because the url://buildtest/ connection has not been established, and it did not come up within 20000ms of waiting. Retry once the server logs 'url://buildtest/ connection established; ingestion and CI orchestration enabled.' cause: null at foundation.url.resolver.sandbox.TypeMarshaling.fromJvmResult$foundation_url_resolver_sandbox(TypeMarshaling.kt:692) at foundation.url.resolver.sandbox.InstanceMethodDispatcher$invokeWithActivity$3.invoke(SandboxedProxyGenerator.kt:2106) at foundation.url.resolver.sandbox.InstanceMethodDispatcher$invokeWithActivity$3.invoke(SandboxedProxyGenerator.kt:2037) at foundation.url.resolver.sandbox.SandboxedProxyGeneratorKt$invokeSandboxMethod$future$1$result$1.invoke(SandboxedProxyGenerator.kt:1491) at community.kotlin.clocks.hierarchical.RequiredClockPadKt.withRequiredClockPad(RequiredClockPad.kt:89) at foundation.url.resolver.sandbox.SandboxedProxyGeneratorKt.invokeSandboxMethod$lambda$4(SandboxedProxyGenerator.kt:1491) at java.base/java.util.concurrent.FutureTask.run(FutureTask.java:317) at foundation.url.resolver.sandbox.SandboxInvocationLane.runScheduled(SandboxedProxyGenerator.kt:1379) at foundation.url.resolver.sandbox.SandboxInvocationLane.schedule$lambda$5(SandboxedProxyGenerator.kt:1370) at java.base/java.util.concurrent.ThreadPoolExecutor.runWorker(ThreadPoolExecutor.java:1144) at java.base/java.util.concurrent.ThreadPoolExecutor$Worker.run(ThreadPoolExecutor.java:642) at java.base/java.lang.Thread.run(Thread.java:1583) Caused by: java.lang.RuntimeException: java.lang.InternalError: Exception encountered in implementation of foundation/url/sjvm/intrinsics/ServiceBridge:rpc(Ljava/lang/String;Ljava/util/Map;)Ljava/util/Map; : foundation.url.resolver.UrlResolutionException: RPC request 'finalizeUpload' failed: INTERNAL_ERROR - RPC error: -1 - IllegalStateException: Cannot run CI operation 'finalizeUpload' because the url://buildtest/ connection has not been established, and it did not come up within 20000ms of waiting. Retry once the server logs 'url://buildtest/ connection established; ingestion and CI orchestration enabled.' at foundation.url.resolver.sandbox.TypeMarshaling.fromJvmResult$foundation_url_resolver_sandbox(TypeMarshaling.kt:695) ... 11 more | this service | |
| build remote stop | CodexCoder21Organization/ContainerNursery | Remote stop attempt 8 for check run 123710719080 failed: foundation.url.protocol.sandbox.SandboxException: Sandboxed code threw an exception: java.lang.InternalError: Exception encountered in implementation of foundation/url/sjvm/intrinsics/ServiceBridge:rpc(Ljava/lang/String;Ljava/util/Map;)Ljava/util/Map; : foundation.url.resolver.UrlResolutionException: RPC request 'supersedeBuildRun' failed: RELAY_ERROR - Handler error: RPC error: INTERNAL_ERROR - Cannot supersede build run '78027f97': it is already in terminal status FAILED. Only in-progress builds can be superseded. cause: null. The cancellation stays saved; retrying in 1920000ms. | this service | |
| build remote stop | CodexCoder21Organization/ContainerNursery | Remote stop attempt 10 for check run 122894390167 failed: foundation.url.protocol.sandbox.SandboxException: Sandboxed code threw an exception: java.lang.InternalError: Exception encountered in implementation of foundation/url/sjvm/intrinsics/ServiceBridge:rpc(Ljava/lang/String;Ljava/util/Map;)Ljava/util/Map; : foundation.url.resolver.UrlResolutionException: RPC request 'supersedeBuildRun' failed: RELAY_ERROR - Handler error: RPC error: INTERNAL_ERROR - Cannot supersede build run '23e82d63': it is already in terminal status FAILED. Only in-progress builds can be superseded. cause: null. The cancellation stays saved; retrying in 1920000ms. | this service | |
| build remote stop | CodexCoder21Organization/ContainerNursery | Remote stop attempt 7 for check run 123811865446 failed: foundation.url.protocol.sandbox.SandboxException: Sandboxed code threw an exception: java.lang.InternalError: Exception encountered in implementation of foundation/url/sjvm/intrinsics/ServiceBridge:rpc(Ljava/lang/String;Ljava/util/Map;)Ljava/util/Map; : foundation.url.resolver.UrlResolutionException: RPC request 'supersedeBuildRun' failed: RELAY_ERROR - Handler error: RPC error: INTERNAL_ERROR - Cannot supersede build run '2d2142ba': it is already in terminal status FAILED. Only in-progress builds can be superseded. cause: null. The cancellation stays saved; retrying in 1920000ms. | this service | |
| delivery | CodexCoder21Organization/ContainerNursery | GitHub delivered check_run.completed for CodexCoder21Organization/ContainerNursery. | codexcoder21 | |
| delivery | CodexCoder21Organization/ContainerNursery | GitHub delivered check_suite.completed for CodexCoder21Organization/ContainerNursery. | codexcoder21 | |
| delivery | CodexCoder21Organization/ContainerNursery | GitHub delivered check_run.completed for CodexCoder21Organization/ContainerNursery. | github-actions[bot] | |
| delivery | CodexCoder21Organization/ContainerNursery | GitHub delivered check_suite.completed for CodexCoder21Organization/ContainerNursery. | github-actions[bot] | |
| delivery | CodexCoder21Organization/ContainerNursery | GitHub delivered check_run.completed for CodexCoder21Organization/ContainerNursery. | github-actions[bot] | |
| delivery | CodexCoder21Organization/ContainerNursery | GitHub delivered check_suite.completed for CodexCoder21Organization/ContainerNursery. | github-actions[bot] | |
| delivery | CodexCoder21Organization/ContainerNursery | GitHub delivered check_run.completed for CodexCoder21Organization/ContainerNursery. | github-actions[bot] | |
| delivery | CodexCoder21Organization/ContainerNursery | GitHub delivered check_run.completed for CodexCoder21Organization/ContainerNursery. | github-actions[bot] | |
| delivery | CodexCoder21Organization/ContainerNursery | GitHub delivered check_suite.completed for CodexCoder21Organization/ContainerNursery. | github-actions[bot] | |
| delivery | CodexCoder21Organization/ContainerNursery | GitHub delivered check_suite.completed for CodexCoder21Organization/ContainerNursery. | github-actions[bot] | |
| delivery | CodexCoder21Organization/ContainerNursery | GitHub delivered check_run.completed for CodexCoder21Organization/ContainerNursery. | github-actions[bot] | |
| delivery | CodexCoder21Organization/ContainerNursery | GitHub delivered check_suite.completed for CodexCoder21Organization/ContainerNursery. | github-actions[bot] | |
| delivery | CodexCoder21Organization/ContainerNursery | GitHub delivered check_run.completed for CodexCoder21Organization/ContainerNursery. | codexcoder21 | |
| delivery | CodexCoder21Organization/ContainerNursery | GitHub delivered check_suite.completed for CodexCoder21Organization/ContainerNursery. | codexcoder21 | |
| delivery | CodexCoder21Organization/ContainerNursery | GitHub delivered check_suite.completed for CodexCoder21Organization/ContainerNursery. | github-actions[bot] | |
| delivery | CodexCoder21Organization/ContainerNursery | GitHub delivered check_run.completed for CodexCoder21Organization/ContainerNursery. | github-actions[bot] | |
| delivery | CodexCoder21Organization/ContainerNursery | GitHub delivered check_run.completed for CodexCoder21Organization/ContainerNursery. | codexcoder21 | |
| delivery | CodexCoder21Organization/ContainerNursery | GitHub delivered check_suite.completed for CodexCoder21Organization/ContainerNursery. | codexcoder21 | |
| delivery | CodexCoder21Organization/ContainerNursery | GitHub delivered check_suite.completed for CodexCoder21Organization/ContainerNursery. | github-actions[bot] | |
| delivery | CodexCoder21Organization/ContainerNursery | GitHub delivered check_run.completed for CodexCoder21Organization/ContainerNursery. | github-actions[bot] | |
| delivery | CodexCoder21Organization/ContainerNursery | GitHub delivered check_suite.completed for CodexCoder21Organization/ContainerNursery. | github-actions[bot] | |
| delivery | CodexCoder21Organization/ContainerNursery | GitHub delivered check_run.completed for CodexCoder21Organization/ContainerNursery. | github-actions[bot] | |
| delivery | CodexCoder21Organization/ContainerNursery | GitHub delivered check_run.completed for CodexCoder21Organization/ContainerNursery. | github-actions[bot] | |
| delivery | CodexCoder21Organization/ContainerNursery | GitHub delivered check_suite.completed for CodexCoder21Organization/ContainerNursery. | github-actions[bot] | |
| delivery | CodexCoder21Organization/ContainerNursery | GitHub delivered check_run.completed for CodexCoder21Organization/ContainerNursery. | codexcoder21 | |
| delivery | CodexCoder21Organization/ContainerNursery | GitHub delivered check_suite.completed for CodexCoder21Organization/ContainerNursery. | codexcoder21 | |
| delivery | CodexCoder21Organization/ContainerNursery | GitHub delivered check_run.completed for CodexCoder21Organization/ContainerNursery. | github-actions[bot] | |
| delivery | CodexCoder21Organization/ContainerNursery | GitHub delivered check_suite.completed for CodexCoder21Organization/ContainerNursery. | github-actions[bot] | |
| delivery | CodexCoder21Organization/ContainerNursery | GitHub delivered check_run.completed for CodexCoder21Organization/ContainerNursery. | github-actions[bot] | |
| delivery | CodexCoder21Organization/ContainerNursery | GitHub delivered check_suite.completed for CodexCoder21Organization/ContainerNursery. | github-actions[bot] | |
| delivery | CodexCoder21Organization/ContainerNursery | GitHub delivered check_suite.completed for CodexCoder21Organization/ContainerNursery. | codexcoder21 | |
| delivery | CodexCoder21Organization/ContainerNursery | GitHub delivered check_run.completed for CodexCoder21Organization/ContainerNursery. | codexcoder21 | |
| delivery | CodexCoder21Organization/ContainerNursery | GitHub delivered check_run.completed for CodexCoder21Organization/ContainerNursery. | codexcoder21 | |
| delivery | CodexCoder21Organization/ContainerNursery | GitHub delivered check_suite.completed for CodexCoder21Organization/ContainerNursery. | codexcoder21 | |
| delivery | CodexCoder21Organization/ContainerNursery | GitHub delivered check_run.completed for CodexCoder21Organization/ContainerNursery. | codexcoder21 | |
| delivery | CodexCoder21Organization/ContainerNursery | GitHub delivered check_suite.completed for CodexCoder21Organization/ContainerNursery. | codexcoder21 | |
| delivery | CodexCoder21Organization/ContainerNursery | GitHub delivered check_run.completed for CodexCoder21Organization/ContainerNursery. | github-actions[bot] | |
| delivery | CodexCoder21Organization/ContainerNursery | GitHub delivered check_suite.completed for CodexCoder21Organization/ContainerNursery. | github-actions[bot] | |
| delivery | CodexCoder21Organization/ContainerNursery | GitHub delivered check_run.completed for CodexCoder21Organization/ContainerNursery. | github-actions[bot] | |
| delivery | CodexCoder21Organization/ContainerNursery | GitHub delivered check_suite.completed for CodexCoder21Organization/ContainerNursery. | github-actions[bot] | |
| build recovery failed | CodexCoder21Organization/ContainerNursery | Failed to recover shadow check 123493730395: foundation.url.protocol.sandbox.SandboxException: Sandboxed code threw an exception: java.lang.InternalError: Exception encountered in implementation of foundation/url/sjvm/intrinsics/ServiceBridge:rpc(Ljava/lang/String;Ljava/util/Map;)Ljava/util/Map; : foundation.url.resolver.UrlResolutionException: RPC request 'cancelCiBuild' failed: INTERNAL_ERROR - RPC error: -1 - IllegalStateException: Cannot run CI operation 'cancelCiBuild' because the url://buildtest/ connection has not been established, and it did not come up within 20000ms of waiting. Retry once the server logs 'url://buildtest/ connection established; ingestion and CI orchestration enabled.' cause: null at foundation.url.resolver.sandbox.TypeMarshaling.fromJvmResult$foundation_url_resolver_sandbox(TypeMarshaling.kt:692) at foundation.url.resolver.sandbox.InstanceMethodDispatcher$invokeWithActivity$3.invoke(SandboxedProxyGenerator.kt:2106) at foundation.url.resolver.sandbox.InstanceMethodDispatcher$invokeWithActivity$3.invoke(SandboxedProxyGenerator.kt:2037) at foundation.url.resolver.sandbox.SandboxedProxyGeneratorKt$invokeSandboxMethod$future$1$result$1.invoke(SandboxedProxyGenerator.kt:1491) at community.kotlin.clocks.hierarchical.RequiredClockPadKt.withRequiredClockPad(RequiredClockPad.kt:89) at foundation.url.resolver.sandbox.SandboxedProxyGeneratorKt.invokeSandboxMethod$lambda$4(SandboxedProxyGenerator.kt:1491) at java.base/java.util.concurrent.FutureTask.run(FutureTask.java:317) at foundation.url.resolver.sandbox.SandboxInvocationLane.runScheduled(SandboxedProxyGenerator.kt:1379) at foundation.url.resolver.sandbox.SandboxInvocationLane.schedule$lambda$5(SandboxedProxyGenerator.kt:1370) at java.base/java.util.concurrent.ThreadPoolExecutor.runWorker(ThreadPoolExecutor.java:1144) at java.base/java.util.concurrent.ThreadPoolExecutor$Worker.run(ThreadPoolExecutor.java:642) at java.base/java.lang.Thread.run(Thread.java:1583) Suppressed: foundation.url.protocol.sandbox.SandboxException: Sandboxed code threw an exception: java.lang.InternalError: Exception encountered in implementation of foundation/url/sjvm/intrinsics/ServiceBridge:rpc(Ljava/lang/String;Ljava/util/Map;)Ljava/util/Map; : foundation.url.resolver.UrlResolutionException: RPC request 'getCiBuild' failed: INTERNAL_ERROR - RPC error: -1 - IllegalStateException: Cannot run CI operation 'getCiBuild' because the url://buildtest/ connection has not been established, and it did not come up within 20000ms of waiting. Retry once the server logs 'url://buildtest/ connection established; ingestion and CI orchestration enabled.' cause: null ... 12 more Caused by: java.lang.RuntimeException: java.lang.InternalError: Exception encountered in implementation of foundation/url/sjvm/intrinsics/ServiceBridge:rpc(Ljava/lang/String;Ljava/util/Map;)Ljava/util/Map; : foundation.url.resolver.UrlResolutionException: RPC request 'getCiBuild' failed: INTERNAL_ERROR - RPC error: -1 - IllegalStateException: Cannot run CI operation 'getCiBuild' because the url://buildtest/ connection has not been established, and it did not come up within 20000ms of waiting. Retry once the server logs 'url://buildtest/ connection established; ingestion and CI orchestration enabled.' at foundation.url.resolver.sandbox.TypeMarshaling.fromJvmResult$foundation_url_resolver_sandbox(TypeMarshaling.kt:695) ... 11 more Suppressed: java.lang.IllegalStateException: Remote termination proof read failed for check run 123493730395, remote run 16bb4b00-a68d-49c3-97f5-25c48a2fa1c5, attempt generation 0; expected reason="build exceeded its overall deadline while deferred", bypassMessage=null, conclusion="failure", summary="Build never started because the runner was saturated: every build worker was already running a check. It waited 141770s in the deferred queue before the existing local deferred-submission deadline expired.\n\nBuild exceeded its local deferred-submission deadline of 180 minutes after 150073s elapsed since submission. No remote buildtest run was admitted. The local queue deadline survives service restarts.", operationMode=LOCAL_RESULT, proof any terminal status. The remote operation failed with foundation.url.protocol.sandbox.SandboxException: Sandboxed code threw an exception: java.lang.InternalError: Exception encountered in implementation of foundation/url/sjvm/intrinsics/ServiceBridge:rpc(Ljava/lang/String;Ljava/util/Map;)Ljava/util/Map; : foundation.url.resolver.UrlResolutionException: RPC request 'cancelCiBuild' failed: INTERNAL_ERROR - RPC error: -1 - IllegalStateException: Cannot run CI operation 'cancelCiBuild' because the url://buildtest/ connection has not been established, and it did not come up within 20000ms of waiting. Retry once the server logs 'url://buildtest/ connection established; ingestion and CI orchestration enabled.' cause: null; getBuildRun then failed with foundation.url.protocol.sandbox.SandboxException: Sandboxed code threw an exception: java.lang.InternalError: Exception encountered in implementation of foundation/url/sjvm/intrinsics/ServiceBridge:rpc(Ljava/lang/String;Ljava/util/Map;)Ljava/util/Map; : foundation.url.resolver.UrlResolutionException: RPC request 'getCiBuild' failed: INTERNAL_ERROR - RPC error: -1 - IllegalStateException: Cannot run CI operation 'getCiBuild' because the url://buildtest/ connection has not been established, and it did not come up within 20000ms of waiting. Retry once the server logs 'url://buildtest/ connection established; ingestion and CI orchestration enabled.' cause: null. at org.example.ci.BuildRunner.reconcileRemoteRunTermination(BuildRunner.kt:4204) at org.example.ci.BuildRunner.requestRemoteRunTermination(BuildRunner.kt:4026) at org.example.ci.BuildRunner.requestRemoteRunTermination$default(BuildRunner.kt:4002) at org.example.ci.BuildRunner.cancelAllRemoteRuns(BuildRunner.kt:3961) at org.example.ci.BuildRunner.cancelAllRemoteRuns$default(BuildRunner.kt:3882) at org.example.ci.BuildRunner.cancelBuildsForRepo$lambda$251(BuildRunner.kt:5802) at org.example.ci.BuildRunner.withCheckOperation(BuildRunner.kt:2143) at org.example.ci.BuildRunner.cancelBuildsForRepo(BuildRunner.kt:5668) at org.example.ci.BuildRunner.cancelBuildsForRepo$default(BuildRunner.kt:5362) at org.example.ci.BuildRunner.cancelRemoteRunsBeforeOwnedCompletion(BuildRunner.kt:5307) at org.example.ci.BuildRunner.cancelRemoteRunsBeforeOwnedCompletion$default(BuildRunner.kt:5251) at org.example.ci.BuildRunner.completeDeferredDeadline(BuildRunner.kt:4675) at org.example.ci.BuildRunner.resumeBuildAsRecovery(BuildRunner.kt:8057) at org.example.ci.BuildRunner.resumeBuildAsRecovery$default(BuildRunner.kt:7853) at org.example.ci.BuildRunner.resumeBuildWithOutcome$lambda$331(BuildRunner.kt:7843) at org.example.ci.BuildRunner.withSandboxRpcWorkClass(BuildRunner.kt:2447) at org.example.ci.BuildRunner.resumeBuildWithOutcome(BuildRunner.kt:7797) at org.example.ci.BuildRunner.resumeBuildWithOutcome$default(BuildRunner.kt:7797) at org.example.ci.BuildRunner.resumeBuild$org_example_ci(BuildRunner.kt:7796) at org.example.ci.BuildRunner.recoverPersistedDeferredBuilds(BuildRunner.kt:3877) at org.example.ci.CiServiceStartup.recoverBuilds(CiServiceStartup.kt:91) at org.example.ci.CiServiceAssembly.start$lambda$3(Main.kt:1009) at org.example.ci.CiServiceStartup.start(CiServiceStartup.kt:80) at org.example.ci.CiServiceAssembly.start(Main.kt:1059) at org.example.ci.MainKt.main(Main.kt:810) at org.example.ci.MainKt.main(Main.kt) Caused by: java.lang.RuntimeException: java.lang.InternalError: Exception encountered in implementation of foundation/url/sjvm/intrinsics/ServiceBridge:rpc(Ljava/lang/String;Ljava/util/Map;)Ljava/util/Map; : foundation.url.resolver.UrlResolutionException: RPC request 'cancelCiBuild' failed: INTERNAL_ERROR - RPC error: -1 - IllegalStateException: Cannot run CI operation 'cancelCiBuild' because the url://buildtest/ connection has not been established, and it did not come up within 20000ms of waiting. Retry once the server logs 'url://buildtest/ connection established; ingestion and CI orchestration enabled.' at foundation.url.resolver.sandbox.TypeMarshaling.fromJvmResult$foundation_url_resolver_sandbox(TypeMarshaling.kt:695) ... 11 more | this service | |
| build remote stop | CodexCoder21Organization/ContainerNursery | Remote stop attempt 14 for check run 123207798433 failed: foundation.url.protocol.sandbox.SandboxException: Sandboxed code threw an exception: java.lang.InternalError: Exception encountered in implementation of foundation/url/sjvm/intrinsics/ServiceBridge:rpc(Ljava/lang/String;Ljava/util/Map;)Ljava/util/Map; : foundation.url.resolver.UrlResolutionException: RPC request 'supersedeBuildRun' failed: INTERNAL_ERROR - RPC error: INTERNAL_ERROR - Cannot supersede build run '450dd0a5': it is already in terminal status FAILED. Only in-progress builds can be superseded. cause: null. The cancellation stays saved; retrying in 1920000ms. | this service | |
| build remote stop | CodexCoder21Organization/ContainerNursery | Remote stop attempt 18 for check run 123189389727 failed: foundation.url.protocol.sandbox.SandboxException: Sandboxed code threw an exception: java.lang.InternalError: Exception encountered in implementation of foundation/url/sjvm/intrinsics/ServiceBridge:rpc(Ljava/lang/String;Ljava/util/Map;)Ljava/util/Map; : foundation.url.resolver.UrlResolutionException: RPC request 'supersedeBuildRun' failed: INTERNAL_ERROR - RPC error: INTERNAL_ERROR - Cannot supersede build run 'f4a3ed31': it is already in terminal status FAILED. Only in-progress builds can be superseded. cause: null. The cancellation stays saved; retrying in 1920000ms. | this service | |
| delivery | CodexCoder21Organization/ContainerNursery | GitHub delivered check_run.completed for CodexCoder21Organization/ContainerNursery. | github-merge-queue[bot] | |
| delivery | CodexCoder21Organization/ContainerNursery | GitHub delivered check_suite.completed for CodexCoder21Organization/ContainerNursery. | github-merge-queue[bot] | |
| completed | CodexCoder21Organization/ContainerNursery | Build failed: 1488 passed, 82 failed, 1570 total | this service | |
| build status recovered | CodexCoder21Organization/ContainerNursery | Status of remote run 1ab6861c is observable again (status=FAILED) after 4708556ms unobservable across 1 degraded retry cycle(s). | this service | |
| build remote stop | CodexCoder21Organization/ContainerNursery | Remote stop attempt 6 for check run 123811865446 failed: foundation.url.protocol.sandbox.SandboxException: Sandboxed code threw an exception: java.lang.InternalError: Exception encountered in implementation of foundation/url/sjvm/intrinsics/ServiceBridge:rpc(Ljava/lang/String;Ljava/util/Map;)Ljava/util/Map; : foundation.url.resolver.UrlResolutionException: RPC request 'supersedeBuildRun' failed: INTERNAL_ERROR - RPC error: INTERNAL_ERROR - Cannot supersede build run '2d2142ba': it is already in terminal status FAILED. Only in-progress builds can be superseded. cause: null. The cancellation stays saved; retrying in 1920000ms. | this service | |
| build recovery failed | CodexCoder21Organization/ContainerNursery | Failed to recover shadow check 123497509354: foundation.url.protocol.sandbox.SandboxException: Sandboxed code threw an exception: java.lang.InternalError: Exception encountered in implementation of foundation/url/sjvm/intrinsics/ServiceBridge:rpc(Ljava/lang/String;Ljava/util/Map;)Ljava/util/Map; : foundation.url.resolver.UrlResolutionException: RPC request 'cancelCiBuild' failed: INTERNAL_ERROR - RPC error: -1 - IllegalStateException: Cannot run CI operation 'cancelCiBuild' because the url://buildtest/ connection has not been established, and it did not come up within 20000ms of waiting. Retry once the server logs 'url://buildtest/ connection established; ingestion and CI orchestration enabled.' cause: null at foundation.url.resolver.sandbox.TypeMarshaling.fromJvmResult$foundation_url_resolver_sandbox(TypeMarshaling.kt:692) at foundation.url.resolver.sandbox.InstanceMethodDispatcher$invokeWithActivity$3.invoke(SandboxedProxyGenerator.kt:2106) at foundation.url.resolver.sandbox.InstanceMethodDispatcher$invokeWithActivity$3.invoke(SandboxedProxyGenerator.kt:2037) at foundation.url.resolver.sandbox.SandboxedProxyGeneratorKt$invokeSandboxMethod$future$1$result$1.invoke(SandboxedProxyGenerator.kt:1491) at community.kotlin.clocks.hierarchical.RequiredClockPadKt.withRequiredClockPad(RequiredClockPad.kt:89) at foundation.url.resolver.sandbox.SandboxedProxyGeneratorKt.invokeSandboxMethod$lambda$4(SandboxedProxyGenerator.kt:1491) at java.base/java.util.concurrent.FutureTask.run(FutureTask.java:317) at foundation.url.resolver.sandbox.SandboxInvocationLane.runScheduled(SandboxedProxyGenerator.kt:1379) at foundation.url.resolver.sandbox.SandboxInvocationLane.schedule$lambda$5(SandboxedProxyGenerator.kt:1370) at java.base/java.util.concurrent.ThreadPoolExecutor.runWorker(ThreadPoolExecutor.java:1144) at java.base/java.util.concurrent.ThreadPoolExecutor$Worker.run(ThreadPoolExecutor.java:642) at java.base/java.lang.Thread.run(Thread.java:1583) Suppressed: foundation.url.protocol.sandbox.SandboxException: Sandboxed code threw an exception: java.lang.InternalError: Exception encountered in implementation of foundation/url/sjvm/intrinsics/ServiceBridge:rpc(Ljava/lang/String;Ljava/util/Map;)Ljava/util/Map; : foundation.url.resolver.UrlResolutionException: RPC request 'getCiBuild' failed: INTERNAL_ERROR - RPC error: -1 - IllegalStateException: Cannot run CI operation 'getCiBuild' because the url://buildtest/ connection has not been established, and it did not come up within 20000ms of waiting. Retry once the server logs 'url://buildtest/ connection established; ingestion and CI orchestration enabled.' cause: null ... 12 more Caused by: java.lang.RuntimeException: java.lang.InternalError: Exception encountered in implementation of foundation/url/sjvm/intrinsics/ServiceBridge:rpc(Ljava/lang/String;Ljava/util/Map;)Ljava/util/Map; : foundation.url.resolver.UrlResolutionException: RPC request 'getCiBuild' failed: INTERNAL_ERROR - RPC error: -1 - IllegalStateException: Cannot run CI operation 'getCiBuild' because the url://buildtest/ connection has not been established, and it did not come up within 20000ms of waiting. Retry once the server logs 'url://buildtest/ connection established; ingestion and CI orchestration enabled.' at foundation.url.resolver.sandbox.TypeMarshaling.fromJvmResult$foundation_url_resolver_sandbox(TypeMarshaling.kt:695) ... 11 more Suppressed: java.lang.IllegalStateException: Remote termination proof read failed for check run 123497509354, remote run ca26f644-36e4-4e8d-90a3-a12aa20411f4, attempt generation 0; expected reason="build exceeded its overall deadline while deferred", bypassMessage=null, conclusion="failure", summary="Build never started because the runner was saturated: every build worker was already running a check. It waited 139228s in the deferred queue before the existing local deferred-submission deadline expired.\n\nBuild exceeded its local deferred-submission deadline of 180 minutes after 147092s elapsed since submission. No remote buildtest run was admitted. The local queue deadline survives service restarts.", operationMode=LOCAL_RESULT, proof any terminal status. The remote operation failed with foundation.url.protocol.sandbox.SandboxException: Sandboxed code threw an exception: java.lang.InternalError: Exception encountered in implementation of foundation/url/sjvm/intrinsics/ServiceBridge:rpc(Ljava/lang/String;Ljava/util/Map;)Ljava/util/Map; : foundation.url.resolver.UrlResolutionException: RPC request 'cancelCiBuild' failed: INTERNAL_ERROR - RPC error: -1 - IllegalStateException: Cannot run CI operation 'cancelCiBuild' because the url://buildtest/ connection has not been established, and it did not come up within 20000ms of waiting. Retry once the server logs 'url://buildtest/ connection established; ingestion and CI orchestration enabled.' cause: null; getBuildRun then failed with foundation.url.protocol.sandbox.SandboxException: Sandboxed code threw an exception: java.lang.InternalError: Exception encountered in implementation of foundation/url/sjvm/intrinsics/ServiceBridge:rpc(Ljava/lang/String;Ljava/util/Map;)Ljava/util/Map; : foundation.url.resolver.UrlResolutionException: RPC request 'getCiBuild' failed: INTERNAL_ERROR - RPC error: -1 - IllegalStateException: Cannot run CI operation 'getCiBuild' because the url://buildtest/ connection has not been established, and it did not come up within 20000ms of waiting. Retry once the server logs 'url://buildtest/ connection established; ingestion and CI orchestration enabled.' cause: null. at org.example.ci.BuildRunner.reconcileRemoteRunTermination(BuildRunner.kt:4204) at org.example.ci.BuildRunner.requestRemoteRunTermination(BuildRunner.kt:4026) at org.example.ci.BuildRunner.requestRemoteRunTermination$default(BuildRunner.kt:4002) at org.example.ci.BuildRunner.cancelAllRemoteRuns(BuildRunner.kt:3961) at org.example.ci.BuildRunner.cancelAllRemoteRuns$default(BuildRunner.kt:3882) at org.example.ci.BuildRunner.cancelBuildsForRepo$lambda$251(BuildRunner.kt:5802) at org.example.ci.BuildRunner.withCheckOperation(BuildRunner.kt:2143) at org.example.ci.BuildRunner.cancelBuildsForRepo(BuildRunner.kt:5668) at org.example.ci.BuildRunner.cancelBuildsForRepo$default(BuildRunner.kt:5362) at org.example.ci.BuildRunner.cancelRemoteRunsBeforeOwnedCompletion(BuildRunner.kt:5307) at org.example.ci.BuildRunner.cancelRemoteRunsBeforeOwnedCompletion$default(BuildRunner.kt:5251) at org.example.ci.BuildRunner.completeDeferredDeadline(BuildRunner.kt:4675) at org.example.ci.BuildRunner.resumeBuildAsRecovery(BuildRunner.kt:8057) at org.example.ci.BuildRunner.resumeBuildAsRecovery$default(BuildRunner.kt:7853) at org.example.ci.BuildRunner.resumeBuildWithOutcome$lambda$331(BuildRunner.kt:7843) at org.example.ci.BuildRunner.withSandboxRpcWorkClass(BuildRunner.kt:2447) at org.example.ci.BuildRunner.resumeBuildWithOutcome(BuildRunner.kt:7797) at org.example.ci.BuildRunner.resumeBuildWithOutcome$default(BuildRunner.kt:7797) at org.example.ci.BuildRunner.resumeBuild$org_example_ci(BuildRunner.kt:7796) at org.example.ci.BuildRunner.recoverPersistedDeferredBuilds(BuildRunner.kt:3877) at org.example.ci.CiServiceStartup.recoverBuilds(CiServiceStartup.kt:91) at org.example.ci.CiServiceAssembly.start$lambda$3(Main.kt:1009) at org.example.ci.CiServiceStartup.start(CiServiceStartup.kt:80) at org.example.ci.CiServiceAssembly.start(Main.kt:1059) at org.example.ci.MainKt.main(Main.kt:810) at org.example.ci.MainKt.main(Main.kt) Caused by: java.lang.RuntimeException: java.lang.InternalError: Exception encountered in implementation of foundation/url/sjvm/intrinsics/ServiceBridge:rpc(Ljava/lang/String;Ljava/util/Map;)Ljava/util/Map; : foundation.url.resolver.UrlResolutionException: RPC request 'cancelCiBuild' failed: INTERNAL_ERROR - RPC error: -1 - IllegalStateException: Cannot run CI operation 'cancelCiBuild' because the url://buildtest/ connection has not been established, and it did not come up within 20000ms of waiting. Retry once the server logs 'url://buildtest/ connection established; ingestion and CI orchestration enabled.' at foundation.url.resolver.sandbox.TypeMarshaling.fromJvmResult$foundation_url_resolver_sandbox(TypeMarshaling.kt:695) ... 11 more | this service | |
| build remote stop | CodexCoder21Organization/ContainerNursery | Remote stop attempt 9 for check run 122894390167 failed: foundation.url.protocol.sandbox.SandboxException: Sandboxed code threw an exception: java.lang.InternalError: Exception encountered in implementation of foundation/url/sjvm/intrinsics/ServiceBridge:rpc(Ljava/lang/String;Ljava/util/Map;)Ljava/util/Map; : foundation.url.resolver.UrlResolutionException: RPC request 'supersedeBuildRun' failed: INTERNAL_ERROR - RPC error: INTERNAL_ERROR - Cannot supersede build run '23e82d63': it is already in terminal status FAILED. Only in-progress builds can be superseded. cause: null. The cancellation stays saved; retrying in 1920000ms. | this service | |
| delivery | CodexCoder21Organization/ContainerNursery | GitHub delivered check_suite.completed for CodexCoder21Organization/ContainerNursery. | codexcoder21 | |
| delivery | CodexCoder21Organization/ContainerNursery | GitHub delivered check_run.completed for CodexCoder21Organization/ContainerNursery. | codexcoder21 | |
| completed | CodexCoder21Organization/ContainerNursery | Build failed: 1608 passed, 130 failed, 1738 total | this service | |
| build status recovered | CodexCoder21Organization/ContainerNursery | Status of remote run d1907214 is observable again (status=FAILED) after 4810899ms unobservable across 1 degraded retry cycle(s). | this service | |
| build remote stop | CodexCoder21Organization/ContainerNursery | Remote stop attempt 7 for check run 123710719080 failed: foundation.url.protocol.sandbox.SandboxException: Sandboxed code threw an exception: java.lang.InternalError: Exception encountered in implementation of foundation/url/sjvm/intrinsics/ServiceBridge:rpc(Ljava/lang/String;Ljava/util/Map;)Ljava/util/Map; : foundation.url.resolver.UrlResolutionException: RPC request 'supersedeBuildRun' failed: INTERNAL_ERROR - RPC error: INTERNAL_ERROR - Cannot supersede build run '78027f97': it is already in terminal status FAILED. Only in-progress builds can be superseded. cause: null. The cancellation stays saved; retrying in 1920000ms. | this service | |
| delivery | CodexCoder21Organization/ContainerNursery | GitHub delivered check_suite.completed for CodexCoder21Organization/ContainerNursery. | codexcoder21 | |
| delivery | CodexCoder21Organization/ContainerNursery | GitHub delivered check_run.completed for CodexCoder21Organization/ContainerNursery. | codexcoder21 | |
| completed | CodexCoder21Organization/ContainerNursery | Build failed: 1499 passed, 85 failed, 1584 total | this service | |
| build status recovered | CodexCoder21Organization/ContainerNursery | Status of remote run d061986b is observable again (status=FAILED) after 4403039ms unobservable across 1 degraded retry cycle(s). | this service | |
| build remote stop | CodexCoder21Organization/ContainerNursery | Remote stop attempt 13 for check run 123207798433 failed: foundation.url.protocol.sandbox.SandboxException: Sandboxed code threw an exception: java.lang.InternalError: Exception encountered in implementation of foundation/url/sjvm/intrinsics/ServiceBridge:rpc(Ljava/lang/String;Ljava/util/Map;)Ljava/util/Map; : foundation.url.resolver.UrlResolutionException: RPC request 'supersedeBuildRun' failed: INTERNAL_ERROR - RPC error: INTERNAL_ERROR - Cannot supersede build run '450dd0a5': it is already in terminal status FAILED. Only in-progress builds can be superseded. cause: null. The cancellation stays saved; retrying in 1920000ms. | this service | |
| delivery | CodexCoder21Organization/ContainerNursery | GitHub delivered check_run.completed for CodexCoder21Organization/ContainerNursery. | codexcoder21 | |
| delivery | CodexCoder21Organization/ContainerNursery | GitHub delivered check_suite.completed for CodexCoder21Organization/ContainerNursery. | codexcoder21 | |
| completed | CodexCoder21Organization/ContainerNursery | Build failed: 1578 passed, 89 failed, 1667 total | this service | |
| delivery | CodexCoder21Organization/ContainerNursery | GitHub delivered check_suite.completed for CodexCoder21Organization/ContainerNursery. | codexcoder21 | |
| delivery | CodexCoder21Organization/ContainerNursery | GitHub delivered check_run.completed for CodexCoder21Organization/ContainerNursery. | codexcoder21 | |
| completed | CodexCoder21Organization/ContainerNursery | Build failed: 1390 passed, 68 failed, 1458 total | this service | |
| build status recovered | CodexCoder21Organization/ContainerNursery | Status of remote run acaaeabb is observable again (status=FAILED) after 4905870ms unobservable across 1 degraded retry cycle(s). | this service | |
| delivery | CodexCoder21Organization/ContainerNursery | GitHub delivered check_run.completed for CodexCoder21Organization/ContainerNursery. | codexcoder21 | |
| delivery | CodexCoder21Organization/ContainerNursery | GitHub delivered check_suite.completed for CodexCoder21Organization/ContainerNursery. | codexcoder21 | |
| completed | CodexCoder21Organization/ContainerNursery | Build failed: 1355 passed, 67 failed, 1422 total | this service | |
| build status recovered | CodexCoder21Organization/ContainerNursery | Status of remote run 46c8455b is observable again (status=FAILED) after 7351771ms unobservable across 1 degraded retry cycle(s). | this service | |
| build remote stop | CodexCoder21Organization/ContainerNursery | Remote stop attempt 17 for check run 123189389727 failed: foundation.url.protocol.sandbox.SandboxException: Sandboxed code threw an exception: java.lang.InternalError: Exception encountered in implementation of foundation/url/sjvm/intrinsics/ServiceBridge:rpc(Ljava/lang/String;Ljava/util/Map;)Ljava/util/Map; : foundation.url.resolver.UrlResolutionException: RPC request 'supersedeBuildRun' failed: INTERNAL_ERROR - RPC error: INTERNAL_ERROR - Cannot supersede build run 'f4a3ed31': it is already in terminal status FAILED. Only in-progress builds can be superseded. cause: null. The cancellation stays saved; retrying in 1920000ms. | this service | |
| delivery | CodexCoder21Organization/ContainerNursery | GitHub delivered check_suite.completed for CodexCoder21Organization/ContainerNursery. | codexcoder21 | |
| delivery | CodexCoder21Organization/ContainerNursery | GitHub delivered check_run.completed for CodexCoder21Organization/ContainerNursery. | codexcoder21 | |
| completed | CodexCoder21Organization/ContainerNursery | Build failed: 1570 passed, 88 failed, 1658 total | this service | |
| build recovery failed | CodexCoder21Organization/ContainerNursery | Failed to recover shadow check 123495032927: foundation.url.protocol.sandbox.SandboxException: Sandboxed code threw an exception: java.lang.InternalError: Exception encountered in implementation of foundation/url/sjvm/intrinsics/ServiceBridge:rpc(Ljava/lang/String;Ljava/util/Map;)Ljava/util/Map; : foundation.url.resolver.UrlResolutionException: RPC request 'cancelCiBuild' failed: INTERNAL_ERROR - RPC error: -1 - IllegalStateException: Cannot run CI operation 'cancelCiBuild' because the url://buildtest/ connection has not been established, and it did not come up within 20000ms of waiting. Retry once the server logs 'url://buildtest/ connection established; ingestion and CI orchestration enabled.' cause: null at foundation.url.resolver.sandbox.TypeMarshaling.fromJvmResult$foundation_url_resolver_sandbox(TypeMarshaling.kt:692) at foundation.url.resolver.sandbox.InstanceMethodDispatcher$invokeWithActivity$3.invoke(SandboxedProxyGenerator.kt:2106) at foundation.url.resolver.sandbox.InstanceMethodDispatcher$invokeWithActivity$3.invoke(SandboxedProxyGenerator.kt:2037) at foundation.url.resolver.sandbox.SandboxedProxyGeneratorKt$invokeSandboxMethod$future$1$result$1.invoke(SandboxedProxyGenerator.kt:1491) at community.kotlin.clocks.hierarchical.RequiredClockPadKt.withRequiredClockPad(RequiredClockPad.kt:89) at foundation.url.resolver.sandbox.SandboxedProxyGeneratorKt.invokeSandboxMethod$lambda$4(SandboxedProxyGenerator.kt:1491) at java.base/java.util.concurrent.FutureTask.run(FutureTask.java:317) at foundation.url.resolver.sandbox.SandboxInvocationLane.runScheduled(SandboxedProxyGenerator.kt:1379) at foundation.url.resolver.sandbox.SandboxInvocationLane.schedule$lambda$5(SandboxedProxyGenerator.kt:1370) at java.base/java.util.concurrent.ThreadPoolExecutor.runWorker(ThreadPoolExecutor.java:1144) at java.base/java.util.concurrent.ThreadPoolExecutor$Worker.run(ThreadPoolExecutor.java:642) at java.base/java.lang.Thread.run(Thread.java:1583) Suppressed: foundation.url.protocol.sandbox.SandboxException: Sandboxed code threw an exception: java.lang.InternalError: Exception encountered in implementation of foundation/url/sjvm/intrinsics/ServiceBridge:rpc(Ljava/lang/String;Ljava/util/Map;)Ljava/util/Map; : foundation.url.resolver.UrlResolutionException: RPC request 'getCiBuild' failed: INTERNAL_ERROR - RPC error: -1 - IllegalStateException: Cannot run CI operation 'getCiBuild' because the url://buildtest/ connection has not been established, and it did not come up within 20000ms of waiting. Retry once the server logs 'url://buildtest/ connection established; ingestion and CI orchestration enabled.' cause: null ... 12 more Caused by: java.lang.RuntimeException: java.lang.InternalError: Exception encountered in implementation of foundation/url/sjvm/intrinsics/ServiceBridge:rpc(Ljava/lang/String;Ljava/util/Map;)Ljava/util/Map; : foundation.url.resolver.UrlResolutionException: RPC request 'getCiBuild' failed: INTERNAL_ERROR - RPC error: -1 - IllegalStateException: Cannot run CI operation 'getCiBuild' because the url://buildtest/ connection has not been established, and it did not come up within 20000ms of waiting. Retry once the server logs 'url://buildtest/ connection established; ingestion and CI orchestration enabled.' at foundation.url.resolver.sandbox.TypeMarshaling.fromJvmResult$foundation_url_resolver_sandbox(TypeMarshaling.kt:695) ... 11 more Suppressed: java.lang.IllegalStateException: Remote termination proof read failed for check run 123495032927, remote run 4c92309a-d078-44d2-8db8-f9a4d500d54a, attempt generation 0; expected reason="build exceeded its overall deadline while deferred", bypassMessage=null, conclusion="failure", summary="Build never started because the runner was saturated: every build worker was already running a check. It waited 137549s in the deferred queue before the existing local deferred-submission deadline expired.\n\nBuild exceeded its local deferred-submission deadline of 180 minutes after 145641s elapsed since submission. No remote buildtest run was admitted. The local queue deadline survives service restarts.", operationMode=LOCAL_RESULT, proof any terminal status. The remote operation failed with foundation.url.protocol.sandbox.SandboxException: Sandboxed code threw an exception: java.lang.InternalError: Exception encountered in implementation of foundation/url/sjvm/intrinsics/ServiceBridge:rpc(Ljava/lang/String;Ljava/util/Map;)Ljava/util/Map; : foundation.url.resolver.UrlResolutionException: RPC request 'cancelCiBuild' failed: INTERNAL_ERROR - RPC error: -1 - IllegalStateException: Cannot run CI operation 'cancelCiBuild' because the url://buildtest/ connection has not been established, and it did not come up within 20000ms of waiting. Retry once the server logs 'url://buildtest/ connection established; ingestion and CI orchestration enabled.' cause: null; getBuildRun then failed with foundation.url.protocol.sandbox.SandboxException: Sandboxed code threw an exception: java.lang.InternalError: Exception encountered in implementation of foundation/url/sjvm/intrinsics/ServiceBridge:rpc(Ljava/lang/String;Ljava/util/Map;)Ljava/util/Map; : foundation.url.resolver.UrlResolutionException: RPC request 'getCiBuild' failed: INTERNAL_ERROR - RPC error: -1 - IllegalStateException: Cannot run CI operation 'getCiBuild' because the url://buildtest/ connection has not been established, and it did not come up within 20000ms of waiting. Retry once the server logs 'url://buildtest/ connection established; ingestion and CI orchestration enabled.' cause: null. at org.example.ci.BuildRunner.reconcileRemoteRunTermination(BuildRunner.kt:4204) at org.example.ci.BuildRunner.requestRemoteRunTermination(BuildRunner.kt:4026) at org.example.ci.BuildRunner.requestRemoteRunTermination$default(BuildRunner.kt:4002) at org.example.ci.BuildRunner.cancelAllRemoteRuns(BuildRunner.kt:3961) at org.example.ci.BuildRunner.cancelAllRemoteRuns$default(BuildRunner.kt:3882) at org.example.ci.BuildRunner.cancelBuildsForRepo$lambda$251(BuildRunner.kt:5802) at org.example.ci.BuildRunner.withCheckOperation(BuildRunner.kt:2143) at org.example.ci.BuildRunner.cancelBuildsForRepo(BuildRunner.kt:5668) at org.example.ci.BuildRunner.cancelBuildsForRepo$default(BuildRunner.kt:5362) at org.example.ci.BuildRunner.cancelRemoteRunsBeforeOwnedCompletion(BuildRunner.kt:5307) at org.example.ci.BuildRunner.cancelRemoteRunsBeforeOwnedCompletion$default(BuildRunner.kt:5251) at org.example.ci.BuildRunner.completeDeferredDeadline(BuildRunner.kt:4675) at org.example.ci.BuildRunner.resumeBuildAsRecovery(BuildRunner.kt:8057) at org.example.ci.BuildRunner.resumeBuildAsRecovery$default(BuildRunner.kt:7853) at org.example.ci.BuildRunner.resumeBuildWithOutcome$lambda$331(BuildRunner.kt:7843) at org.example.ci.BuildRunner.withSandboxRpcWorkClass(BuildRunner.kt:2447) at org.example.ci.BuildRunner.resumeBuildWithOutcome(BuildRunner.kt:7797) at org.example.ci.BuildRunner.resumeBuildWithOutcome$default(BuildRunner.kt:7797) at org.example.ci.BuildRunner.resumeBuild$org_example_ci(BuildRunner.kt:7796) at org.example.ci.BuildRunner.recoverPersistedDeferredBuilds(BuildRunner.kt:3877) at org.example.ci.CiServiceStartup.recoverBuilds(CiServiceStartup.kt:91) at org.example.ci.CiServiceAssembly.start$lambda$3(Main.kt:1009) at org.example.ci.CiServiceStartup.start(CiServiceStartup.kt:80) at org.example.ci.CiServiceAssembly.start(Main.kt:1059) at org.example.ci.MainKt.main(Main.kt:810) at org.example.ci.MainKt.main(Main.kt) Caused by: java.lang.RuntimeException: java.lang.InternalError: Exception encountered in implementation of foundation/url/sjvm/intrinsics/ServiceBridge:rpc(Ljava/lang/String;Ljava/util/Map;)Ljava/util/Map; : foundation.url.resolver.UrlResolutionException: RPC request 'cancelCiBuild' failed: INTERNAL_ERROR - RPC error: -1 - IllegalStateException: Cannot run CI operation 'cancelCiBuild' because the url://buildtest/ connection has not been established, and it did not come up within 20000ms of waiting. Retry once the server logs 'url://buildtest/ connection established; ingestion and CI orchestration enabled.' at foundation.url.resolver.sandbox.TypeMarshaling.fromJvmResult$foundation_url_resolver_sandbox(TypeMarshaling.kt:695) ... 11 more | this service | |
| delivery | CodexCoder21Organization/ContainerNursery | GitHub delivered check_suite.completed for CodexCoder21Organization/ContainerNursery. | codexcoder21 | |
| delivery | CodexCoder21Organization/ContainerNursery | GitHub delivered check_run.completed for CodexCoder21Organization/ContainerNursery. | codexcoder21 | |
| completed | CodexCoder21Organization/ContainerNursery | Build failed: 1492 passed, 93 failed, 1585 total | this service | |
| delivery | CodexCoder21Organization/ContainerNursery | GitHub delivered check_run.completed for CodexCoder21Organization/ContainerNursery. | codexcoder21 | |
| delivery | CodexCoder21Organization/ContainerNursery | GitHub delivered check_suite.completed for CodexCoder21Organization/ContainerNursery. | codexcoder21 | |
| completed | CodexCoder21Organization/ContainerNursery | Build failed: 1506 passed, 79 failed, 1585 total | this service | |
| delivery | CodexCoder21Organization/ContainerNursery | GitHub delivered check_run.completed for CodexCoder21Organization/ContainerNursery. | codexcoder21 | |
| delivery | CodexCoder21Organization/ContainerNursery | GitHub delivered check_suite.completed for CodexCoder21Organization/ContainerNursery. | codexcoder21 | |
| delivery | CodexCoder21Organization/ContainerNursery | GitHub delivered check_run.completed for CodexCoder21Organization/ContainerNursery. | codexcoder21 | |
| delivery | CodexCoder21Organization/ContainerNursery | GitHub delivered check_suite.completed for CodexCoder21Organization/ContainerNursery. | codexcoder21 | |
| completed | CodexCoder21Organization/ContainerNursery | Build never started because the runner was saturated: every build worker was already running a check. It waited 0s in the deferred queue before the existing local deferred-submission deadline expired. | this service | |
| delivery | CodexCoder21Organization/ContainerNursery | GitHub delivered check_run.completed for CodexCoder21Organization/ContainerNursery. | codexcoder21 | |
| delivery | CodexCoder21Organization/ContainerNursery | GitHub delivered check_suite.completed for CodexCoder21Organization/ContainerNursery. | codexcoder21 | |
| completed | CodexCoder21Organization/ContainerNursery | Build never started because the runner was saturated: every build worker was already running a check. It waited 0s in the deferred queue before the existing local deferred-submission deadline expired. | this service | |
| delivery | CodexCoder21Organization/ContainerNursery | GitHub delivered check_run.completed for CodexCoder21Organization/ContainerNursery. | codexcoder21 | |
| completed | CodexCoder21Organization/ContainerNursery | Build never started because the runner was saturated: every build worker was already running a check. It waited 0s in the deferred queue before the existing local deferred-submission deadline expired. | this service | |
| delivery | CodexCoder21Organization/ContainerNursery | GitHub delivered check_suite.completed for CodexCoder21Organization/ContainerNursery. | codexcoder21 | |
| delivery | CodexCoder21Organization/ContainerNursery | GitHub delivered check_run.completed for CodexCoder21Organization/ContainerNursery. | codexcoder21 | |
| completed | CodexCoder21Organization/ContainerNursery | Build never started because the runner was saturated: every build worker was already running a check. It waited 0s in the deferred queue before the existing local deferred-submission deadline expired. | this service | |
| delivery | CodexCoder21Organization/ContainerNursery | GitHub delivered check_suite.completed for CodexCoder21Organization/ContainerNursery. | codexcoder21 | |
| delivery | CodexCoder21Organization/ContainerNursery | GitHub delivered check_run.completed for CodexCoder21Organization/ContainerNursery. | codexcoder21 | |
| delivery | CodexCoder21Organization/ContainerNursery | GitHub delivered check_suite.completed for CodexCoder21Organization/ContainerNursery. | codexcoder21 | |
| completed | CodexCoder21Organization/ContainerNursery | Build never started because the runner was saturated: every build worker was already running a check. It waited 0s in the deferred queue before the existing local deferred-submission deadline expired. | this service | |
| completed | CodexCoder21Organization/ContainerNursery | Build failed: 1507 passed, 78 failed, 1585 total | this service | |
| delivery | CodexCoder21Organization/ContainerNursery | GitHub delivered check_run.completed for CodexCoder21Organization/ContainerNursery. | codexcoder21 | |
| delivery | CodexCoder21Organization/ContainerNursery | GitHub delivered check_suite.completed for CodexCoder21Organization/ContainerNursery. | codexcoder21 | |
| completed | CodexCoder21Organization/ContainerNursery | Build never started because the runner was saturated: every build worker was already running a check. It waited 0s in the deferred queue before the existing local deferred-submission deadline expired. | this service | |
| delivery | CodexCoder21Organization/ContainerNursery | GitHub delivered check_suite.completed for CodexCoder21Organization/ContainerNursery. | codexcoder21 | |
| delivery | CodexCoder21Organization/ContainerNursery | GitHub delivered check_run.completed for CodexCoder21Organization/ContainerNursery. | codexcoder21 | |
| delivery | CodexCoder21Organization/ContainerNursery | GitHub delivered check_run.completed for CodexCoder21Organization/ContainerNursery. | codexcoder21 | |
| delivery | CodexCoder21Organization/ContainerNursery | GitHub delivered check_suite.completed for CodexCoder21Organization/ContainerNursery. | codexcoder21 | |
| completed | CodexCoder21Organization/ContainerNursery | Build never started because the runner was saturated: every build worker was already running a check. It waited 0s in the deferred queue before the existing local deferred-submission deadline expired. | this service | |
| completed | CodexCoder21Organization/ContainerNursery | Build never started because the runner was saturated: every build worker was already running a check. It waited 0s in the deferred queue before the existing local deferred-submission deadline expired. | this service | |
| delivery | CodexCoder21Organization/ContainerNursery | GitHub delivered check_run.completed for CodexCoder21Organization/ContainerNursery. | codexcoder21 | |
| delivery | CodexCoder21Organization/ContainerNursery | GitHub delivered check_suite.completed for CodexCoder21Organization/ContainerNursery. | codexcoder21 | |
| delivery | CodexCoder21Organization/ContainerNursery | GitHub delivered check_suite.completed for CodexCoder21Organization/ContainerNursery. | codexcoder21 | |
| delivery | CodexCoder21Organization/ContainerNursery | GitHub delivered check_run.completed for CodexCoder21Organization/ContainerNursery. | codexcoder21 | |
| completed | CodexCoder21Organization/ContainerNursery | Build never started because the runner was saturated: every build worker was already running a check. It waited 0s in the deferred queue before the existing local deferred-submission deadline expired. | this service | |
| completed | CodexCoder21Organization/ContainerNursery | Build never started because the runner was saturated: every build worker was already running a check. It waited 0s in the deferred queue before the existing local deferred-submission deadline expired. | this service | |
| delivery | CodexCoder21Organization/ContainerNursery | GitHub delivered check_run.completed for CodexCoder21Organization/ContainerNursery. | codexcoder21 | |
| delivery | CodexCoder21Organization/ContainerNursery | GitHub delivered check_suite.completed for CodexCoder21Organization/ContainerNursery. | codexcoder21 | |
| completed | CodexCoder21Organization/ContainerNursery | Build failed: 1605 passed, 133 failed, 1738 total | this service | |
| delivery | CodexCoder21Organization/ContainerNursery | GitHub delivered check_run.completed for CodexCoder21Organization/ContainerNursery. | codexcoder21 | |
| delivery | CodexCoder21Organization/ContainerNursery | GitHub delivered check_suite.completed for CodexCoder21Organization/ContainerNursery. | codexcoder21 | |
| completed | CodexCoder21Organization/ContainerNursery | Build failed: 1501 passed, 84 failed, 1585 total | this service | |
| build status degraded | CodexCoder21Organization/ContainerNursery | Status of remote run 1ab6861c has been unobservable for 302452ms (degraded retry cycle 1). Check run 123666536353 stays in progress; status reconciliation will be retried in 60000ms. Cause: Status poll for build run 1ab6861c (CodexCoder21Organization/ContainerNursery) was unavailable continuously for 302234ms, reaching the transient-failure budget of 300000ms. Last error: Sandboxed code threw an exception: java.lang.InternalError: Exception encountered in implementation of foundation/url/sjvm/intrinsics/ServiceBridge:rpc(Ljava/lang/String;Ljava/util/Map;)Ljava/util/Map; : foundation.url.resolver.UrlResolutionException: RPC request 'getBuildRun' failed: INTERNAL_ERROR - Service handler timed out after 30 seconds without producing a result. The handler may be blocked or deadlocked. cause: null | this service | |
| build status degraded | CodexCoder21Organization/ContainerNursery | Status of remote run d061986b has been unobservable for 342386ms (degraded retry cycle 1). Check run 123649309865 stays in progress; status reconciliation will be retried in 60000ms. Cause: Status poll for build run d061986b (CodexCoder21Organization/ContainerNursery) was unavailable continuously for 342232ms, reaching the transient-failure budget of 300000ms. Last error: Sandboxed code threw an exception: java.lang.InternalError: Exception encountered in implementation of foundation/url/sjvm/intrinsics/ServiceBridge:rpc(Ljava/lang/String;Ljava/util/Map;)Ljava/util/Map; : foundation.url.resolver.UrlResolutionException: RPC request 'getBuildRun' failed: INTERNAL_ERROR - Service handler timed out after 30 seconds without producing a result. The handler may be blocked or deadlocked. cause: null | this service | |
| build status degraded | CodexCoder21Organization/ContainerNursery | Status of remote run d1907214 has been unobservable for 460036ms (degraded retry cycle 1). Check run 123648255225 stays in progress; status reconciliation will be retried in 60000ms. Cause: Status poll for build run d1907214 (CodexCoder21Organization/ContainerNursery) was unavailable continuously for 455554ms, reaching the transient-failure budget of 300000ms. Last error: Sandboxed code threw an exception: java.lang.InternalError: Exception encountered in implementation of foundation/url/sjvm/intrinsics/ServiceBridge:rpc(Ljava/lang/String;Ljava/util/Map;)Ljava/util/Map; : foundation.url.resolver.UrlResolutionException: RPC request 'getBuildRun' failed: INTERNAL_ERROR - Service handler timed out after 30 seconds without producing a result. The handler may be blocked or deadlocked. cause: null | this service | |
| build remote stop | CodexCoder21Organization/ContainerNursery | Remote stop attempt 8 for check run 122894390167 failed: foundation.url.protocol.sandbox.SandboxException: Sandboxed code threw an exception: java.lang.InternalError: Exception encountered in implementation of foundation/url/sjvm/intrinsics/ServiceBridge:rpc(Ljava/lang/String;Ljava/util/Map;)Ljava/util/Map; : foundation.url.resolver.UrlResolutionException: RPC request 'supersedeBuildRun' failed: INTERNAL_ERROR - RPC error: INTERNAL_ERROR - Cannot supersede build run '23e82d63': it is already in terminal status FAILED. Only in-progress builds can be superseded. cause: null. The cancellation stays saved; retrying in 1920000ms. | this service | |
| delivery | CodexCoder21Organization/ContainerNursery | GitHub delivered check_suite.completed for CodexCoder21Organization/ContainerNursery. | codexcoder21 | |
| delivery | CodexCoder21Organization/ContainerNursery | GitHub delivered check_run.completed for CodexCoder21Organization/ContainerNursery. | codexcoder21 | |
| completed | CodexCoder21Organization/ContainerNursery | Build failed: 1373 passed, 68 failed, 1441 total | this service | |
| build status recovered | CodexCoder21Organization/ContainerNursery | Status of remote run 6b3309de is observable again (status=FAILED) after 7457775ms unobservable across 1 degraded retry cycle(s). | this service | |
| build pending | CodexCoder21Organization/ContainerNursery | Remote run 010a0a12 remains PENDING after 62752s of queue wait; waiting for buildtest admission. | this service | |
| delivery | CodexCoder21Organization/ContainerNursery | GitHub delivered check_run.completed for CodexCoder21Organization/ContainerNursery. | github-merge-queue[bot] | |
| delivery | CodexCoder21Organization/ContainerNursery | GitHub delivered check_suite.completed for CodexCoder21Organization/ContainerNursery. | github-merge-queue[bot] | |
| completed | CodexCoder21Organization/ContainerNursery | Build failed: 1360 passed, 66 failed, 1426 total | this service | |
| build status recovered | CodexCoder21Organization/ContainerNursery | Status of remote run f1beeb0a is observable again (status=FAILED) after 6357930ms unobservable across 1 degraded retry cycle(s). | this service | |
| build pending | CodexCoder21Organization/ContainerNursery | Remote run 12af0c24 remains PENDING after 76094s of queue wait; waiting for buildtest admission. | this service | |
| build pending | CodexCoder21Organization/ContainerNursery | Remote run 010a0a12 remains PENDING after 62431s of queue wait; waiting for buildtest admission. | this service | |
| build remote stop | CodexCoder21Organization/ContainerNursery | Remote stop attempt 6 for check run 123710719080 failed: foundation.url.protocol.sandbox.SandboxException: Sandboxed code threw an exception: java.lang.InternalError: Exception encountered in implementation of foundation/url/sjvm/intrinsics/ServiceBridge:rpc(Ljava/lang/String;Ljava/util/Map;)Ljava/util/Map; : foundation.url.resolver.UrlResolutionException: RPC request 'supersedeBuildRun' failed: INTERNAL_ERROR - RPC error: INTERNAL_ERROR - Cannot supersede build run '78027f97': it is already in terminal status FAILED. Only in-progress builds can be superseded. cause: null. The cancellation stays saved; retrying in 1920000ms. | this service | |
| delivery | CodexCoder21Organization/ContainerNursery | GitHub delivered check_suite.completed for CodexCoder21Organization/ContainerNursery. | github-merge-queue[bot] | |
| delivery | CodexCoder21Organization/ContainerNursery | GitHub delivered check_run.completed for CodexCoder21Organization/ContainerNursery. | github-merge-queue[bot] | |
| completed | CodexCoder21Organization/ContainerNursery | Build failed: 1387 passed, 68 failed, 1455 total | this service | |
| build status degraded | CodexCoder21Organization/ContainerNursery | Status of remote run acaaeabb has been unobservable for 436077ms (degraded retry cycle 1). Check run 123002248133 stays in progress; status reconciliation will be retried in 60000ms. Cause: Status poll for build run acaaeabb (CodexCoder21Organization/ContainerNursery) was unavailable continuously for 435692ms, reaching the transient-failure budget of 300000ms. Last error: Sandboxed code threw an exception: java.lang.InternalError: Exception encountered in implementation of foundation/url/sjvm/intrinsics/ServiceBridge:rpc(Ljava/lang/String;Ljava/util/Map;)Ljava/util/Map; : foundation.url.resolver.UrlResolutionException: RPC request 'getBuildRun' failed: INTERNAL_ERROR - Service handler timed out after 30 seconds without producing a result. The handler may be blocked or deadlocked. cause: null | this service | |
| build pending | CodexCoder21Organization/ContainerNursery | Remote run 12af0c24 remains PENDING after 75717s of queue wait; waiting for buildtest admission. | this service | |
| build pending | CodexCoder21Organization/ContainerNursery | Remote run 010a0a12 remains PENDING after 61951s of queue wait; waiting for buildtest admission. | this service | |
| build pending | CodexCoder21Organization/ContainerNursery | Remote run 12af0c24 remains PENDING after 75376s of queue wait; waiting for buildtest admission. | this service | |
| build pending | CodexCoder21Organization/ContainerNursery | Remote run 010a0a12 remains PENDING after 61463s of queue wait; waiting for buildtest admission. | this service | |
| build pending | CodexCoder21Organization/ContainerNursery | Remote run 12af0c24 remains PENDING after 75045s of queue wait; waiting for buildtest admission. | this service | |
| delivery | CodexCoder21Organization/ContainerNursery | GitHub delivered check_run.completed for CodexCoder21Organization/ContainerNursery. | codexcoder21 | |
| delivery | CodexCoder21Organization/ContainerNursery | GitHub delivered check_run.completed for CodexCoder21Organization/ContainerNursery. | codexcoder21 | |
| completed | CodexCoder21Organization/ContainerNursery | Build never started because the runner was saturated: every build worker was already running a check. It waited 193s in the deferred queue before the existing local deferred-submission deadline expired. | this service | |
| completed | CodexCoder21Organization/ContainerNursery | Build never started because the runner was saturated: every build worker was already running a check. It waited 180s in the deferred queue before the existing local deferred-submission deadline expired. | this service | |
| build pending | CodexCoder21Organization/ContainerNursery | Remote run 12af0c24 remains PENDING after 74601s of queue wait; waiting for buildtest admission. | this service | |
| delivery | CodexCoder21Organization/ContainerNursery | GitHub delivered check_run.completed for CodexCoder21Organization/ContainerNursery. | codexcoder21 | |
| delivery | CodexCoder21Organization/ContainerNursery | GitHub delivered check_run.completed for CodexCoder21Organization/ContainerNursery. | codexcoder21 | |
| delivery | CodexCoder21Organization/ContainerNursery | GitHub delivered check_suite.completed for CodexCoder21Organization/ContainerNursery. | codexcoder21 | |
| completed | CodexCoder21Organization/ContainerNursery | Build never started because the runner was saturated: every build worker was already running a check. It waited 42s in the deferred queue before the existing local deferred-submission deadline expired. | this service | |
| completed | CodexCoder21Organization/ContainerNursery | Build never started because the runner was saturated: every build worker was already running a check. It waited 75s in the deferred queue before the existing local deferred-submission deadline expired. | this service | |
| build pending | CodexCoder21Organization/ContainerNursery | Remote run 010a0a12 remains PENDING after 60961s of queue wait; waiting for buildtest admission. | this service | |
| delivery | CodexCoder21Organization/ContainerNursery | GitHub delivered check_run.completed for CodexCoder21Organization/ContainerNursery. | codexcoder21 | |
| delivery | CodexCoder21Organization/ContainerNursery | GitHub delivered check_suite.completed for CodexCoder21Organization/ContainerNursery. | codexcoder21 | |
| completed | CodexCoder21Organization/ContainerNursery | Build never started because the runner was saturated: every build worker was already running a check. It waited 38s in the deferred queue before the existing local deferred-submission deadline expired. | this service | |
| delivery | CodexCoder21Organization/ContainerNursery | GitHub delivered check_run.completed for CodexCoder21Organization/ContainerNursery. | codexcoder21 | |
| delivery | CodexCoder21Organization/ContainerNursery | GitHub delivered check_suite.completed for CodexCoder21Organization/ContainerNursery. | codexcoder21 | |
| delivery | CodexCoder21Organization/ContainerNursery | GitHub delivered check_suite.completed for CodexCoder21Organization/ContainerNursery. | codexcoder21 | |
| delivery | CodexCoder21Organization/ContainerNursery | GitHub delivered check_run.completed for CodexCoder21Organization/ContainerNursery. | codexcoder21 | |
| delivery | CodexCoder21Organization/ContainerNursery | GitHub delivered check_run.completed for CodexCoder21Organization/ContainerNursery. | codexcoder21 | |
| delivery | CodexCoder21Organization/ContainerNursery | GitHub delivered check_run.completed for CodexCoder21Organization/ContainerNursery. | codexcoder21 | |
| delivery | CodexCoder21Organization/ContainerNursery | GitHub delivered check_suite.completed for CodexCoder21Organization/ContainerNursery. | codexcoder21 | |
| delivery | CodexCoder21Organization/ContainerNursery | GitHub delivered check_suite.completed for CodexCoder21Organization/ContainerNursery. | codexcoder21 | |
| completed | CodexCoder21Organization/ContainerNursery | Build never started because the runner was saturated: every build worker was already running a check. It waited 6s in the deferred queue before the existing local deferred-submission deadline expired. | this service | |
| completed | CodexCoder21Organization/ContainerNursery | Build never started because the runner was saturated: every build worker was already running a check. It waited 1s in the deferred queue before the existing local deferred-submission deadline expired. | this service | |
| completed | CodexCoder21Organization/ContainerNursery | Build never started because the runner was saturated: every build worker was already running a check. It waited 48s in the deferred queue before the existing local deferred-submission deadline expired. | this service | |
| completed | CodexCoder21Organization/ContainerNursery | Build never started because the runner was saturated: every build worker was already running a check. It waited 46s in the deferred queue before the existing local deferred-submission deadline expired. | this service | |
| delivery | CodexCoder21Organization/ContainerNursery | GitHub delivered check_run.completed for CodexCoder21Organization/ContainerNursery. | codexcoder21 | |
| delivery | CodexCoder21Organization/ContainerNursery | GitHub delivered check_suite.completed for CodexCoder21Organization/ContainerNursery. | codexcoder21 | |
| delivery | CodexCoder21Organization/ContainerNursery | GitHub delivered check_run.completed for CodexCoder21Organization/ContainerNursery. | codexcoder21 | |
| delivery | CodexCoder21Organization/ContainerNursery | GitHub delivered check_suite.completed for CodexCoder21Organization/ContainerNursery. | codexcoder21 |