Trigger log
Every delivery GitHub sent and what this service did with it — including the ones that produced no build. Newest first.
| When | What | Repository | Detail | Who |
|---|---|---|---|---|
| build remote stop | CodexCoder21Organization/HandoffApi | Remote stop attempt 10 for check run 123238567626 failed: foundation.url.protocol.sandbox.SandboxException: Sandboxed code threw an exception: java.lang.InternalError: Exception encountered in implementation of foundation/url/sjvm/intrinsics/ServiceBridge:rpc(Ljava/lang/String;Ljava/util/Map;)Ljava/util/Map; : foundation.url.resolver.UrlResolutionException: RPC request 'supersedeBuildRun' failed: RELAY_ERROR - Handler error: RPC error: INTERNAL_ERROR - Cannot supersede build run '90a86911': it is already in terminal status FAILED. Only in-progress builds can be superseded. cause: null. The cancellation stays saved; retrying in 1920000ms. | this service | |
| build remote stop | CodexCoder21Organization/HandoffApi | Remote stop attempt 10 for check run 123241277637 failed: foundation.url.protocol.sandbox.SandboxException: Sandboxed code threw an exception: java.lang.InternalError: Exception encountered in implementation of foundation/url/sjvm/intrinsics/ServiceBridge:rpc(Ljava/lang/String;Ljava/util/Map;)Ljava/util/Map; : foundation.url.resolver.UrlResolutionException: RPC request 'supersedeBuildRun' failed: RELAY_ERROR - Handler error: RPC error: INTERNAL_ERROR - Cannot supersede build run '081b5458': it is already in terminal status FAILED. Only in-progress builds can be superseded. cause: null. The cancellation stays saved; retrying in 1920000ms. | this service | |
| build remote stop | CodexCoder21Organization/HandoffApi | Remote stop attempt 9 for check run 123238567626 failed: foundation.url.protocol.sandbox.SandboxException: Sandboxed code threw an exception: java.lang.InternalError: Exception encountered in implementation of foundation/url/sjvm/intrinsics/ServiceBridge:rpc(Ljava/lang/String;Ljava/util/Map;)Ljava/util/Map; : foundation.url.resolver.UrlResolutionException: RPC request 'supersedeBuildRun' failed: RELAY_ERROR - Handler error: RPC error: INTERNAL_ERROR - Cannot supersede build run '90a86911': it is already in terminal status FAILED. Only in-progress builds can be superseded. cause: null. The cancellation stays saved; retrying in 1920000ms. | this service | |
| build remote stop | CodexCoder21Organization/HandoffApi | Remote stop attempt 9 for check run 123241277637 failed: foundation.url.protocol.sandbox.SandboxException: Sandboxed code threw an exception: java.lang.InternalError: Exception encountered in implementation of foundation/url/sjvm/intrinsics/ServiceBridge:rpc(Ljava/lang/String;Ljava/util/Map;)Ljava/util/Map; : foundation.url.resolver.UrlResolutionException: RPC request 'supersedeBuildRun' failed: RELAY_ERROR - Handler error: RPC error: INTERNAL_ERROR - Cannot supersede build run '081b5458': it is already in terminal status FAILED. Only in-progress builds can be superseded. cause: null. The cancellation stays saved; retrying in 1920000ms. | this service | |
| build recovery failed | CodexCoder21Organization/HandoffApi | Failed to recover shadow check 118980095414: foundation.url.protocol.sandbox.SandboxException: Sandboxed code threw an exception: java.lang.InternalError: Exception encountered in implementation of foundation/url/sjvm/intrinsics/ServiceBridge:rpc(Ljava/lang/String;Ljava/util/Map;)Ljava/util/Map; : foundation.url.resolver.UrlResolutionException: RPC request 'finalizeUpload' failed: INTERNAL_ERROR - RPC error: -1 - IllegalStateException: Cannot run CI operation 'finalizeUpload' because the url://buildtest/ connection has not been established, and it did not come up within 20000ms of waiting. Retry once the server logs 'url://buildtest/ connection established; ingestion and CI orchestration enabled.' cause: null at foundation.url.resolver.sandbox.TypeMarshaling.fromJvmResult$foundation_url_resolver_sandbox(TypeMarshaling.kt:692) at foundation.url.resolver.sandbox.InstanceMethodDispatcher$invokeWithActivity$3.invoke(SandboxedProxyGenerator.kt:2106) at foundation.url.resolver.sandbox.InstanceMethodDispatcher$invokeWithActivity$3.invoke(SandboxedProxyGenerator.kt:2037) at foundation.url.resolver.sandbox.SandboxedProxyGeneratorKt$invokeSandboxMethod$future$1$result$1.invoke(SandboxedProxyGenerator.kt:1491) at community.kotlin.clocks.hierarchical.RequiredClockPadKt.withRequiredClockPad(RequiredClockPad.kt:89) at foundation.url.resolver.sandbox.SandboxedProxyGeneratorKt.invokeSandboxMethod$lambda$4(SandboxedProxyGenerator.kt:1491) at java.base/java.util.concurrent.FutureTask.run(FutureTask.java:317) at foundation.url.resolver.sandbox.SandboxInvocationLane.runScheduled(SandboxedProxyGenerator.kt:1379) at foundation.url.resolver.sandbox.SandboxInvocationLane.schedule$lambda$5(SandboxedProxyGenerator.kt:1370) at java.base/java.util.concurrent.ThreadPoolExecutor.runWorker(ThreadPoolExecutor.java:1144) at java.base/java.util.concurrent.ThreadPoolExecutor$Worker.run(ThreadPoolExecutor.java:642) at java.base/java.lang.Thread.run(Thread.java:1583) Caused by: java.lang.RuntimeException: java.lang.InternalError: Exception encountered in implementation of foundation/url/sjvm/intrinsics/ServiceBridge:rpc(Ljava/lang/String;Ljava/util/Map;)Ljava/util/Map; : foundation.url.resolver.UrlResolutionException: RPC request 'finalizeUpload' failed: INTERNAL_ERROR - RPC error: -1 - IllegalStateException: Cannot run CI operation 'finalizeUpload' because the url://buildtest/ connection has not been established, and it did not come up within 20000ms of waiting. Retry once the server logs 'url://buildtest/ connection established; ingestion and CI orchestration enabled.' at foundation.url.resolver.sandbox.TypeMarshaling.fromJvmResult$foundation_url_resolver_sandbox(TypeMarshaling.kt:695) ... 11 more | this service | |
| build remote stop | CodexCoder21Organization/HandoffApi | Remote stop attempt 8 for check run 123238567626 failed: foundation.url.protocol.sandbox.SandboxException: Sandboxed code threw an exception: java.lang.InternalError: Exception encountered in implementation of foundation/url/sjvm/intrinsics/ServiceBridge:rpc(Ljava/lang/String;Ljava/util/Map;)Ljava/util/Map; : foundation.url.resolver.UrlResolutionException: RPC request 'supersedeBuildRun' failed: RELAY_ERROR - Handler error: RPC error: INTERNAL_ERROR - Cannot supersede build run '90a86911': it is already in terminal status FAILED. Only in-progress builds can be superseded. cause: null. The cancellation stays saved; retrying in 1920000ms. | this service | |
| build remote stop | CodexCoder21Organization/HandoffApi | Remote stop attempt 8 for check run 123241277637 failed: foundation.url.protocol.sandbox.SandboxException: Sandboxed code threw an exception: java.lang.InternalError: Exception encountered in implementation of foundation/url/sjvm/intrinsics/ServiceBridge:rpc(Ljava/lang/String;Ljava/util/Map;)Ljava/util/Map; : foundation.url.resolver.UrlResolutionException: RPC request 'supersedeBuildRun' failed: RELAY_ERROR - Handler error: RPC error: INTERNAL_ERROR - Cannot supersede build run '081b5458': it is already in terminal status FAILED. Only in-progress builds can be superseded. cause: null. The cancellation stays saved; retrying in 1920000ms. | this service | |
| delivery | CodexCoder21Organization/HandoffApi | GitHub delivered check_run.completed for CodexCoder21Organization/HandoffApi. | codexcoder21 | |
| delivery | CodexCoder21Organization/HandoffApi | GitHub delivered check_suite.completed for CodexCoder21Organization/HandoffApi. | codexcoder21 | |
| completed | CodexCoder21Organization/HandoffApi | Build failed: 124 passed, 6 failed, 130 total | this service | |
| build remote stop | CodexCoder21Organization/HandoffApi | Remote stop attempt 7 for check run 123238567626 failed: foundation.url.protocol.sandbox.SandboxException: Sandboxed code threw an exception: java.lang.InternalError: Exception encountered in implementation of foundation/url/sjvm/intrinsics/ServiceBridge:rpc(Ljava/lang/String;Ljava/util/Map;)Ljava/util/Map; : foundation.url.resolver.UrlResolutionException: RPC request 'supersedeBuildRun' failed: RELAY_ERROR - Handler error: RPC error: INTERNAL_ERROR - Cannot supersede build run '90a86911': it is already in terminal status FAILED. Only in-progress builds can be superseded. cause: null. The cancellation stays saved; retrying in 1920000ms. | this service | |
| build remote stop | CodexCoder21Organization/HandoffApi | Remote stop attempt 7 for check run 123241277637 failed: foundation.url.protocol.sandbox.SandboxException: Sandboxed code threw an exception: java.lang.InternalError: Exception encountered in implementation of foundation/url/sjvm/intrinsics/ServiceBridge:rpc(Ljava/lang/String;Ljava/util/Map;)Ljava/util/Map; : foundation.url.resolver.UrlResolutionException: RPC request 'supersedeBuildRun' failed: RELAY_ERROR - Handler error: RPC error: INTERNAL_ERROR - Cannot supersede build run '081b5458': it is already in terminal status FAILED. Only in-progress builds can be superseded. cause: null. The cancellation stays saved; retrying in 1920000ms. | this service | |
| build alignment redriven | CodexCoder21Organization/HandoffApi | Rebuilt under the same check: in progress for 3127 minutes on the current pull-request head with no tracked build. | this service | |
| build remote stop | CodexCoder21Organization/HandoffApi | Remote stop attempt 6 for check run 123238567626 failed: foundation.url.protocol.sandbox.SandboxException: Sandboxed code threw an exception: java.lang.InternalError: Exception encountered in implementation of foundation/url/sjvm/intrinsics/ServiceBridge:rpc(Ljava/lang/String;Ljava/util/Map;)Ljava/util/Map; : foundation.url.resolver.UrlResolutionException: RPC request 'supersedeBuildRun' failed: INTERNAL_ERROR - RPC error: INTERNAL_ERROR - Cannot supersede build run '90a86911': it is already in terminal status FAILED. Only in-progress builds can be superseded. cause: null. The cancellation stays saved; retrying in 1920000ms. | this service | |
| build remote stop | CodexCoder21Organization/HandoffApi | Remote stop attempt 6 for check run 123241277637 failed: foundation.url.protocol.sandbox.SandboxException: Sandboxed code threw an exception: java.lang.InternalError: Exception encountered in implementation of foundation/url/sjvm/intrinsics/ServiceBridge:rpc(Ljava/lang/String;Ljava/util/Map;)Ljava/util/Map; : foundation.url.resolver.UrlResolutionException: RPC request 'supersedeBuildRun' failed: INTERNAL_ERROR - RPC error: INTERNAL_ERROR - Cannot supersede build run '081b5458': it is already in terminal status FAILED. Only in-progress builds can be superseded. cause: null. The cancellation stays saved; retrying in 1920000ms. | this service | |
| build remote stop | CodexCoder21Organization/HandoffApi | Remote stop attempt 5 for check run 123241277637 failed: foundation.url.protocol.sandbox.SandboxException: Sandboxed code threw an exception: java.lang.InternalError: Exception encountered in implementation of foundation/url/sjvm/intrinsics/ServiceBridge:rpc(Ljava/lang/String;Ljava/util/Map;)Ljava/util/Map; : foundation.url.resolver.UrlResolutionException: RPC request 'supersedeBuildRun' failed: INTERNAL_ERROR - RPC error: INTERNAL_ERROR - Cannot supersede build run '081b5458': it is already in terminal status FAILED. Only in-progress builds can be superseded. cause: null. The cancellation stays saved; retrying in 960000ms. | this service | |
| delivery | CodexCoder21Organization/HandoffApi | GitHub delivered check_run.completed for CodexCoder21Organization/HandoffApi. | codexcoder21 | |
| delivery | CodexCoder21Organization/HandoffApi | GitHub delivered check_suite.completed for CodexCoder21Organization/HandoffApi. | codexcoder21 | |
| completed | CodexCoder21Organization/HandoffApi | Build never started because the runner was saturated: every build worker was already running a check. It waited 0s in the deferred queue before the existing local deferred-submission deadline expired. | this service | |
| build remote stop | CodexCoder21Organization/HandoffApi | Remote stop attempt 5 for check run 123238567626 failed: foundation.url.protocol.sandbox.SandboxException: Sandboxed code threw an exception: java.lang.InternalError: Exception encountered in implementation of foundation/url/sjvm/intrinsics/ServiceBridge:rpc(Ljava/lang/String;Ljava/util/Map;)Ljava/util/Map; : foundation.url.resolver.UrlResolutionException: RPC request 'supersedeBuildRun' failed: INTERNAL_ERROR - RPC error: INTERNAL_ERROR - Cannot supersede build run '90a86911': it is already in terminal status FAILED. Only in-progress builds can be superseded. cause: null. The cancellation stays saved; retrying in 960000ms. | this service | |
| build remote stop | CodexCoder21Organization/HandoffApi | Remote stop attempt 4 for check run 123241277637 failed: foundation.url.protocol.sandbox.SandboxException: Sandboxed code threw an exception: java.lang.InternalError: Exception encountered in implementation of foundation/url/sjvm/intrinsics/ServiceBridge:rpc(Ljava/lang/String;Ljava/util/Map;)Ljava/util/Map; : foundation.url.resolver.UrlResolutionException: RPC request 'supersedeBuildRun' failed: INTERNAL_ERROR - RPC error: INTERNAL_ERROR - Cannot supersede build run '081b5458': it is already in terminal status FAILED. Only in-progress builds can be superseded. cause: null. The cancellation stays saved; retrying in 480000ms. | this service | |
| build remote stop | CodexCoder21Organization/HandoffApi | Remote stop attempt 4 for check run 123238567626 failed: foundation.url.protocol.sandbox.SandboxException: Sandboxed code threw an exception: java.lang.InternalError: Exception encountered in implementation of foundation/url/sjvm/intrinsics/ServiceBridge:rpc(Ljava/lang/String;Ljava/util/Map;)Ljava/util/Map; : foundation.url.resolver.UrlResolutionException: RPC request 'supersedeBuildRun' failed: INTERNAL_ERROR - RPC error: INTERNAL_ERROR - Cannot supersede build run '90a86911': it is already in terminal status FAILED. Only in-progress builds can be superseded. cause: null. The cancellation stays saved; retrying in 480000ms. | this service | |
| build remote stop | CodexCoder21Organization/HandoffApi | Remote stop attempt 3 for check run 123241277637 failed: foundation.url.protocol.sandbox.SandboxException: Sandboxed code threw an exception: java.lang.InternalError: Exception encountered in implementation of foundation/url/sjvm/intrinsics/ServiceBridge:rpc(Ljava/lang/String;Ljava/util/Map;)Ljava/util/Map; : foundation.url.resolver.UrlResolutionException: RPC request 'supersedeBuildRun' failed: INTERNAL_ERROR - RPC error: INTERNAL_ERROR - Cannot supersede build run '081b5458': it is already in terminal status FAILED. Only in-progress builds can be superseded. cause: null. The cancellation stays saved; retrying in 240000ms. | this service | |
| build remote stop | CodexCoder21Organization/HandoffApi | Remote stop attempt 2 for check run 123241277637 failed: foundation.url.protocol.sandbox.SandboxException: Sandboxed code threw an exception: java.lang.InternalError: Exception encountered in implementation of foundation/url/sjvm/intrinsics/ServiceBridge:rpc(Ljava/lang/String;Ljava/util/Map;)Ljava/util/Map; : foundation.url.resolver.UrlResolutionException: RPC request 'supersedeBuildRun' failed: INTERNAL_ERROR - RPC error: INTERNAL_ERROR - Cannot supersede build run '081b5458': it is already in terminal status FAILED. Only in-progress builds can be superseded. cause: null. The cancellation stays saved; retrying in 120000ms. | this service | |
| build remote stop | CodexCoder21Organization/HandoffApi | Remote stop attempt 3 for check run 123238567626 failed: foundation.url.protocol.sandbox.SandboxException: Sandboxed code threw an exception: java.lang.InternalError: Exception encountered in implementation of foundation/url/sjvm/intrinsics/ServiceBridge:rpc(Ljava/lang/String;Ljava/util/Map;)Ljava/util/Map; : foundation.url.resolver.UrlResolutionException: RPC request 'supersedeBuildRun' failed: INTERNAL_ERROR - RPC error: INTERNAL_ERROR - Cannot supersede build run '90a86911': it is already in terminal status FAILED. Only in-progress builds can be superseded. cause: null. The cancellation stays saved; retrying in 240000ms. | this service | |
| delivery | CodexCoder21Organization/HandoffApi | GitHub delivered check_run.completed for CodexCoder21Organization/HandoffApi. | codexcoder21 | |
| completed | CodexCoder21Organization/HandoffApi | Build never started because the runner was saturated: every build worker was already running a check. It waited 4s in the deferred queue before the existing local deferred-submission deadline expired. | this service | |
| delivery | CodexCoder21Organization/HandoffApi | GitHub delivered check_run.completed for CodexCoder21Organization/HandoffApi. | codexcoder21 | |
| completed | CodexCoder21Organization/HandoffApi | Build never started because the runner was saturated: every build worker was already running a check. It waited 1s in the deferred queue before the existing local deferred-submission deadline expired. | this service | |
| delivery | CodexCoder21Organization/HandoffApi | GitHub delivered check_run.completed for CodexCoder21Organization/HandoffApi. | codexcoder21 | |
| completed | CodexCoder21Organization/HandoffApi | Build never started because the runner was saturated: every build worker was already running a check. It waited 1s in the deferred queue before the existing local deferred-submission deadline expired. | this service | |
| delivery | CodexCoder21Organization/HandoffApi | GitHub delivered check_run.completed for CodexCoder21Organization/HandoffApi. | codexcoder21 | |
| completed | CodexCoder21Organization/HandoffApi | Build never started because the runner was saturated: every build worker was already running a check. It waited 0s in the deferred queue before the existing local deferred-submission deadline expired. | this service | |
| build remote stop | CodexCoder21Organization/HandoffApi | Remote stop attempt 1 for check run 123241277637 failed: foundation.url.protocol.sandbox.SandboxException: Sandboxed code threw an exception: java.lang.InternalError: Exception encountered in implementation of foundation/url/sjvm/intrinsics/ServiceBridge:rpc(Ljava/lang/String;Ljava/util/Map;)Ljava/util/Map; : foundation.url.resolver.UrlResolutionException: RPC request 'supersedeBuildRun' failed: INTERNAL_ERROR - RPC error: INTERNAL_ERROR - Cannot supersede build run '081b5458': it is already in terminal status FAILED. Only in-progress builds can be superseded. cause: null. The cancellation stays saved; retrying in 60000ms. | this service | |
| delivery | CodexCoder21Organization/HandoffApi | GitHub delivered check_run.completed for CodexCoder21Organization/HandoffApi. | codexcoder21 | |
| completed | CodexCoder21Organization/HandoffApi | Build never started because the runner was saturated: every build worker was already running a check. It waited 5s in the deferred queue before the existing local deferred-submission deadline expired. | this service | |
| build remote stop | CodexCoder21Organization/HandoffApi | Remote stop attempt 2 for check run 123238567626 failed: foundation.url.protocol.sandbox.SandboxException: Sandboxed code threw an exception: java.lang.InternalError: Exception encountered in implementation of foundation/url/sjvm/intrinsics/ServiceBridge:rpc(Ljava/lang/String;Ljava/util/Map;)Ljava/util/Map; : foundation.url.resolver.UrlResolutionException: RPC request 'supersedeBuildRun' failed: INTERNAL_ERROR - RPC error: INTERNAL_ERROR - Cannot supersede build run '90a86911': it is already in terminal status FAILED. Only in-progress builds can be superseded. cause: null. The cancellation stays saved; retrying in 120000ms. | this service | |
| delivery | CodexCoder21Organization/HandoffApi | GitHub delivered check_run.completed for CodexCoder21Organization/HandoffApi. | codexcoder21 | |
| completed | CodexCoder21Organization/HandoffApi | Build never started because the runner was saturated: every build worker was already running a check. It waited 3s in the deferred queue before the existing local deferred-submission deadline expired. | this service | |
| delivery | CodexCoder21Organization/HandoffApi | GitHub delivered check_run.completed for CodexCoder21Organization/HandoffApi. | codexcoder21 | |
| completed | CodexCoder21Organization/HandoffApi | Build never started because the runner was saturated: every build worker was already running a check. It waited 5s in the deferred queue before the existing local deferred-submission deadline expired. | this service | |
| delivery | CodexCoder21Organization/HandoffApi | GitHub delivered check_run.completed for CodexCoder21Organization/HandoffApi. | codexcoder21 | |
| completed | CodexCoder21Organization/HandoffApi | Build never started because the runner was saturated: every build worker was already running a check. It waited 0s in the deferred queue before the existing local deferred-submission deadline expired. | this service | |
| delivery | CodexCoder21Organization/HandoffApi | GitHub delivered check_run.completed for CodexCoder21Organization/HandoffApi. | codexcoder21 | |
| completed | CodexCoder21Organization/HandoffApi | Build never started because the runner was saturated: every build worker was already running a check. It waited 2s in the deferred queue before the existing local deferred-submission deadline expired. | this service | |
| delivery | CodexCoder21Organization/HandoffApi | GitHub delivered check_run.completed for CodexCoder21Organization/HandoffApi. | codexcoder21 | |
| completed | CodexCoder21Organization/HandoffApi | Build never started because the runner was saturated: every build worker was already running a check. It waited 46s in the deferred queue before the existing local deferred-submission deadline expired. | this service | |
| delivery | CodexCoder21Organization/HandoffApi | GitHub delivered check_run.completed for CodexCoder21Organization/HandoffApi. | codexcoder21 | |
| delivery | CodexCoder21Organization/HandoffApi | GitHub delivered check_suite.completed for CodexCoder21Organization/HandoffApi. | codexcoder21 | |
| completed | CodexCoder21Organization/HandoffApi | Build never started because the runner was saturated: every build worker was already running a check. It waited 4s in the deferred queue before the existing local deferred-submission deadline expired. | this service | |
| delivery | CodexCoder21Organization/HandoffApi | GitHub delivered check_run.completed for CodexCoder21Organization/HandoffApi. | codexcoder21 | |
| delivery | CodexCoder21Organization/HandoffApi | GitHub delivered check_run.created for CodexCoder21Organization/HandoffApi. | codexcoder21 | |
| dispatched | CodexCoder21Organization/HandoffApi | Submitted to the direct-buildtest build service. | this service | |
| delivery | CodexCoder21Organization/HandoffApi | GitHub delivered check_run.created for CodexCoder21Organization/HandoffApi. | codexcoder21 | |
| delivery | CodexCoder21Organization/HandoffApi | GitHub delivered check_run.completed for CodexCoder21Organization/HandoffApi. | codexcoder21 | |
| delivery | CodexCoder21Organization/HandoffApi | GitHub delivered check_suite.completed for CodexCoder21Organization/HandoffApi. | codexcoder21 | |
| completed | CodexCoder21Organization/HandoffApi | Build never started because the runner was saturated: every build worker was already running a check. It waited 0s in the deferred queue before the existing local deferred-submission deadline expired. | this service |