kotlin.build CI

Trigger log

Every delivery GitHub sent and what this service did with it — including the ones that produced no build. Newest first.

WhenWhatRepositoryDetailWho
10m 54s ago build remote stopCodexCoder21Organization/HandoffEmbeddedRemote stop attempt 10 for check run 123396951958 failed: foundation.url.protocol.sandbox.SandboxException: Sandboxed code threw an exception: java.lang.InternalError: Exception encountered in implementation of foundation/url/sjvm/intrinsics/ServiceBridge:rpc(Ljava/lang/String;Ljava/util/Map;)Ljava/util/Map; : foundation.url.resolver.UrlResolutionException: RPC request 'supersedeBuildRun' failed: RELAY_ERROR - Handler error: RPC error: INTERNAL_ERROR - Cannot supersede build run 'fa1c8dfe': it is already in terminal status FAILED. Only in-progress builds can be superseded. cause: null. The cancellation stays saved; retrying in 1920000ms.this service
18m 12s ago build remote stopCodexCoder21Organization/HandoffEmbeddedRemote stop attempt 19 for check run 123237637054 failed: foundation.url.protocol.sandbox.SandboxException: Sandboxed code threw an exception: java.lang.InternalError: Exception encountered in implementation of foundation/url/sjvm/intrinsics/ServiceBridge:rpc(Ljava/lang/String;Ljava/util/Map;)Ljava/util/Map; : foundation.url.resolver.UrlResolutionException: RPC request 'supersedeBuildRun' failed: RELAY_ERROR - Handler error: RPC error: INTERNAL_ERROR - Cannot supersede build run 'b0df4ab1': it is already in terminal status FAILED. Only in-progress builds can be superseded. cause: null. The cancellation stays saved; retrying in 1920000ms.this service
28m 54s ago build remote stopCodexCoder21Organization/HandoffEmbeddedRemote stop attempt 11 for check run 123355709083 failed: foundation.url.protocol.sandbox.SandboxException: Sandboxed code threw an exception: java.lang.InternalError: Exception encountered in implementation of foundation/url/sjvm/intrinsics/ServiceBridge:rpc(Ljava/lang/String;Ljava/util/Map;)Ljava/util/Map; : foundation.url.resolver.UrlResolutionException: RPC request 'supersedeBuildRun' failed: RELAY_ERROR - Handler error: RPC error: INTERNAL_ERROR - Cannot supersede build run 'de2f0a80': it is already in terminal status FAILED. Only in-progress builds can be superseded. cause: null. The cancellation stays saved; retrying in 1920000ms.this service
32m 37s ago build remote stopCodexCoder21Organization/HandoffEmbeddedRemote stop attempt 14 for check run 123240542600 failed: foundation.url.protocol.sandbox.SandboxException: Sandboxed code threw an exception: java.lang.InternalError: Exception encountered in implementation of foundation/url/sjvm/intrinsics/ServiceBridge:rpc(Ljava/lang/String;Ljava/util/Map;)Ljava/util/Map; : foundation.url.resolver.UrlResolutionException: RPC request 'supersedeBuildRun' failed: RELAY_ERROR - Handler error: RPC error: INTERNAL_ERROR - Cannot supersede build run 'f264cca8': it is already in terminal status FAILED. Only in-progress builds can be superseded. cause: null. The cancellation stays saved; retrying in 1920000ms.this service
33m 41s ago build remote stopCodexCoder21Organization/HandoffEmbeddedRemote stop attempt 18 for check run 123237672004 failed: foundation.url.protocol.sandbox.SandboxException: Sandboxed code threw an exception: java.lang.InternalError: Exception encountered in implementation of foundation/url/sjvm/intrinsics/ServiceBridge:rpc(Ljava/lang/String;Ljava/util/Map;)Ljava/util/Map; : foundation.url.resolver.UrlResolutionException: RPC request 'supersedeBuildRun' failed: RELAY_ERROR - Handler error: RPC error: INTERNAL_ERROR - Cannot supersede build run 'b9f6bf0f': it is already in terminal status FAILED. Only in-progress builds can be superseded. cause: null. The cancellation stays saved; retrying in 1920000ms.this service
37m 32s ago build remote stopCodexCoder21Organization/HandoffEmbeddedRemote stop attempt 13 for check run 123302854390 failed: foundation.url.protocol.sandbox.SandboxException: Sandboxed code threw an exception: java.lang.InternalError: Exception encountered in implementation of foundation/url/sjvm/intrinsics/ServiceBridge:rpc(Ljava/lang/String;Ljava/util/Map;)Ljava/util/Map; : foundation.url.resolver.UrlResolutionException: RPC request 'supersedeBuildRun' failed: RELAY_ERROR - Handler error: RPC error: INTERNAL_ERROR - Cannot supersede build run '8b269094': it is already in terminal status FAILED. Only in-progress builds can be superseded. cause: null. The cancellation stays saved; retrying in 1920000ms.this service
43m 35s ago build remote stopCodexCoder21Organization/HandoffEmbeddedRemote stop attempt 17 for check run 123239424206 failed: foundation.url.protocol.sandbox.SandboxException: Sandboxed code threw an exception: java.lang.InternalError: Exception encountered in implementation of foundation/url/sjvm/intrinsics/ServiceBridge:rpc(Ljava/lang/String;Ljava/util/Map;)Ljava/util/Map; : foundation.url.resolver.UrlResolutionException: RPC request 'supersedeBuildRun' failed: RELAY_ERROR - Handler error: RPC error: INTERNAL_ERROR - Cannot supersede build run '24e8c23d': it is already in terminal status FAILED. Only in-progress builds can be superseded. cause: null. The cancellation stays saved; retrying in 1920000ms.this service
43m 36s ago build remote stopCodexCoder21Organization/HandoffEmbeddedRemote stop attempt 18 for check run 123237670992 failed: foundation.url.protocol.sandbox.SandboxException: Sandboxed code threw an exception: java.lang.InternalError: Exception encountered in implementation of foundation/url/sjvm/intrinsics/ServiceBridge:rpc(Ljava/lang/String;Ljava/util/Map;)Ljava/util/Map; : foundation.url.resolver.UrlResolutionException: RPC request 'supersedeBuildRun' failed: RELAY_ERROR - Handler error: RPC error: INTERNAL_ERROR - Cannot supersede build run '1824629e': it is already in terminal status FAILED. Only in-progress builds can be superseded. cause: null. The cancellation stays saved; retrying in 1920000ms.this service
46m 10s ago build remote stopCodexCoder21Organization/HandoffEmbeddedRemote stop attempt 30 for check run 121989746496 failed: java.lang.IllegalStateException: Remote build b138c117 was recorded as terminal before the required remote cancellation was confirmed, but its status read returned status FAILED; expected status CANCELED. Cancellation context: check run 121989746496, attempt generation 0; reason="pull request #18 was closed", bypassMessage=null, conclusion="cancelled", summary="PR #18 was closed, canceling the in-flight build for this pull request.", operationMode=CANCEL. The cancellation stays saved; retrying in 1920000ms.this service
1h 2m ago build remote stopCodexCoder21Organization/HandoffEmbeddedRemote stop attempt 9 for check run 123396951958 failed: foundation.url.protocol.sandbox.SandboxException: Sandboxed code threw an exception: java.lang.InternalError: Exception encountered in implementation of foundation/url/sjvm/intrinsics/ServiceBridge:rpc(Ljava/lang/String;Ljava/util/Map;)Ljava/util/Map; : foundation.url.resolver.UrlResolutionException: RPC request 'supersedeBuildRun' failed: RELAY_ERROR - Handler error: RPC error: INTERNAL_ERROR - Cannot supersede build run 'fa1c8dfe': it is already in terminal status FAILED. Only in-progress builds can be superseded. cause: null. The cancellation stays saved; retrying in 1920000ms.this service
1h 16m ago build remote stopCodexCoder21Organization/HandoffEmbeddedRemote stop attempt 10 for check run 123355709083 failed: foundation.url.protocol.sandbox.SandboxException: Sandboxed code threw an exception: java.lang.InternalError: Exception encountered in implementation of foundation/url/sjvm/intrinsics/ServiceBridge:rpc(Ljava/lang/String;Ljava/util/Map;)Ljava/util/Map; : foundation.url.resolver.UrlResolutionException: RPC request 'supersedeBuildRun' failed: RELAY_ERROR - Handler error: RPC error: INTERNAL_ERROR - Cannot supersede build run 'de2f0a80': it is already in terminal status FAILED. Only in-progress builds can be superseded. cause: null. The cancellation stays saved; retrying in 1920000ms.this service
1h 20m ago build remote stopCodexCoder21Organization/HandoffEmbeddedRemote stop attempt 13 for check run 123240542600 failed: foundation.url.protocol.sandbox.SandboxException: Sandboxed code threw an exception: java.lang.InternalError: Exception encountered in implementation of foundation/url/sjvm/intrinsics/ServiceBridge:rpc(Ljava/lang/String;Ljava/util/Map;)Ljava/util/Map; : foundation.url.resolver.UrlResolutionException: RPC request 'supersedeBuildRun' failed: RELAY_ERROR - Handler error: RPC error: INTERNAL_ERROR - Cannot supersede build run 'f264cca8': it is already in terminal status FAILED. Only in-progress builds can be superseded. cause: null. The cancellation stays saved; retrying in 1920000ms.this service
1h 21m ago build remote stopCodexCoder21Organization/HandoffEmbeddedRemote stop attempt 17 for check run 123237672004 failed: foundation.url.protocol.sandbox.SandboxException: Sandboxed code threw an exception: java.lang.InternalError: Exception encountered in implementation of foundation/url/sjvm/intrinsics/ServiceBridge:rpc(Ljava/lang/String;Ljava/util/Map;)Ljava/util/Map; : foundation.url.resolver.UrlResolutionException: RPC request 'supersedeBuildRun' failed: RELAY_ERROR - Handler error: RPC error: INTERNAL_ERROR - Cannot supersede build run 'b9f6bf0f': it is already in terminal status FAILED. Only in-progress builds can be superseded. cause: null. The cancellation stays saved; retrying in 1920000ms.this service
1h 21m ago build remote stopCodexCoder21Organization/HandoffEmbeddedRemote stop attempt 18 for check run 123237637054 failed: foundation.url.protocol.sandbox.SandboxException: Sandboxed code threw an exception: java.lang.InternalError: Exception encountered in implementation of foundation/url/sjvm/intrinsics/ServiceBridge:rpc(Ljava/lang/String;Ljava/util/Map;)Ljava/util/Map; : foundation.url.resolver.UrlResolutionException: RPC request 'supersedeBuildRun' failed: RELAY_ERROR - Handler error: RPC error: INTERNAL_ERROR - Cannot supersede build run 'b0df4ab1': it is already in terminal status FAILED. Only in-progress builds can be superseded. cause: null. The cancellation stays saved; retrying in 1920000ms.this service
1h 26m ago build remote stopCodexCoder21Organization/HandoffEmbeddedRemote stop attempt 12 for check run 123302854390 failed: foundation.url.protocol.sandbox.SandboxException: Sandboxed code threw an exception: java.lang.InternalError: Exception encountered in implementation of foundation/url/sjvm/intrinsics/ServiceBridge:rpc(Ljava/lang/String;Ljava/util/Map;)Ljava/util/Map; : foundation.url.resolver.UrlResolutionException: RPC request 'supersedeBuildRun' failed: RELAY_ERROR - Handler error: RPC error: INTERNAL_ERROR - Cannot supersede build run '8b269094': it is already in terminal status FAILED. Only in-progress builds can be superseded. cause: null. The cancellation stays saved; retrying in 1920000ms.this service
1h 31m ago build remote stopCodexCoder21Organization/HandoffEmbeddedRemote stop attempt 16 for check run 123239424206 failed: foundation.url.protocol.sandbox.SandboxException: Sandboxed code threw an exception: java.lang.InternalError: Exception encountered in implementation of foundation/url/sjvm/intrinsics/ServiceBridge:rpc(Ljava/lang/String;Ljava/util/Map;)Ljava/util/Map; : foundation.url.resolver.UrlResolutionException: RPC request 'supersedeBuildRun' failed: RELAY_ERROR - Handler error: RPC error: INTERNAL_ERROR - Cannot supersede build run '24e8c23d': it is already in terminal status FAILED. Only in-progress builds can be superseded. cause: null. The cancellation stays saved; retrying in 1920000ms.this service
1h 31m ago build remote stopCodexCoder21Organization/HandoffEmbeddedRemote stop attempt 17 for check run 123237670992 failed: foundation.url.protocol.sandbox.SandboxException: Sandboxed code threw an exception: java.lang.InternalError: Exception encountered in implementation of foundation/url/sjvm/intrinsics/ServiceBridge:rpc(Ljava/lang/String;Ljava/util/Map;)Ljava/util/Map; : foundation.url.resolver.UrlResolutionException: RPC request 'supersedeBuildRun' failed: RELAY_ERROR - Handler error: RPC error: INTERNAL_ERROR - Cannot supersede build run '1824629e': it is already in terminal status FAILED. Only in-progress builds can be superseded. cause: null. The cancellation stays saved; retrying in 1920000ms.this service
1h 35m ago build remote stopCodexCoder21Organization/HandoffEmbeddedRemote stop attempt 29 for check run 121989746496 failed: java.lang.IllegalStateException: Remote build b138c117 was recorded as terminal before the required remote cancellation was confirmed, but its status read returned status FAILED; expected status CANCELED. Cancellation context: check run 121989746496, attempt generation 0; reason="pull request #18 was closed", bypassMessage=null, conclusion="cancelled", summary="PR #18 was closed, canceling the in-flight build for this pull request.", operationMode=CANCEL. The cancellation stays saved; retrying in 1920000ms.this service
1h 57m ago build remote stopCodexCoder21Organization/HandoffEmbeddedRemote stop attempt 8 for check run 123396951958 failed: foundation.url.protocol.sandbox.SandboxException: Sandboxed code threw an exception: java.lang.InternalError: Exception encountered in implementation of foundation/url/sjvm/intrinsics/ServiceBridge:rpc(Ljava/lang/String;Ljava/util/Map;)Ljava/util/Map; : foundation.url.resolver.UrlResolutionException: RPC request 'supersedeBuildRun' failed: RELAY_ERROR - Handler error: RPC error: INTERNAL_ERROR - Cannot supersede build run 'fa1c8dfe': it is already in terminal status FAILED. Only in-progress builds can be superseded. cause: null. The cancellation stays saved; retrying in 1920000ms.this service
2h 9m ago build remote stopCodexCoder21Organization/HandoffEmbeddedRemote stop attempt 12 for check run 123240542600 failed: foundation.url.protocol.sandbox.SandboxException: Sandboxed code threw an exception: java.lang.InternalError: Exception encountered in implementation of foundation/url/sjvm/intrinsics/ServiceBridge:rpc(Ljava/lang/String;Ljava/util/Map;)Ljava/util/Map; : foundation.url.resolver.UrlResolutionException: RPC request 'supersedeBuildRun' failed: RELAY_ERROR - Handler error: RPC error: INTERNAL_ERROR - Cannot supersede build run 'f264cca8': it is already in terminal status FAILED. Only in-progress builds can be superseded. cause: null. The cancellation stays saved; retrying in 1920000ms.this service
2h 12m ago build remote stopCodexCoder21Organization/HandoffEmbeddedRemote stop attempt 9 for check run 123355709083 failed: foundation.url.protocol.sandbox.SandboxException: Sandboxed code threw an exception: java.lang.InternalError: Exception encountered in implementation of foundation/url/sjvm/intrinsics/ServiceBridge:rpc(Ljava/lang/String;Ljava/util/Map;)Ljava/util/Map; : foundation.url.resolver.UrlResolutionException: RPC request 'supersedeBuildRun' failed: RELAY_ERROR - Handler error: RPC error: INTERNAL_ERROR - Cannot supersede build run 'de2f0a80': it is already in terminal status FAILED. Only in-progress builds can be superseded. cause: null. The cancellation stays saved; retrying in 1920000ms.this service
2h 12m ago build remote stopCodexCoder21Organization/HandoffEmbeddedRemote stop attempt 17 for check run 123237637054 failed: foundation.url.protocol.sandbox.SandboxException: Sandboxed code threw an exception: java.lang.InternalError: Exception encountered in implementation of foundation/url/sjvm/intrinsics/ServiceBridge:rpc(Ljava/lang/String;Ljava/util/Map;)Ljava/util/Map; : foundation.url.resolver.UrlResolutionException: RPC request 'supersedeBuildRun' failed: RELAY_ERROR - Handler error: RPC error: INTERNAL_ERROR - Cannot supersede build run 'b0df4ab1': it is already in terminal status FAILED. Only in-progress builds can be superseded. cause: null. The cancellation stays saved; retrying in 1920000ms.this service
2h 16m ago build remote stopCodexCoder21Organization/HandoffEmbeddedRemote stop attempt 11 for check run 123302854390 failed: foundation.url.protocol.sandbox.SandboxException: Sandboxed code threw an exception: java.lang.InternalError: Exception encountered in implementation of foundation/url/sjvm/intrinsics/ServiceBridge:rpc(Ljava/lang/String;Ljava/util/Map;)Ljava/util/Map; : foundation.url.resolver.UrlResolutionException: RPC request 'supersedeBuildRun' failed: RELAY_ERROR - Handler error: RPC error: INTERNAL_ERROR - Cannot supersede build run '8b269094': it is already in terminal status FAILED. Only in-progress builds can be superseded. cause: null. The cancellation stays saved; retrying in 1920000ms.this service
2h 20m ago build remote stopCodexCoder21Organization/HandoffEmbeddedRemote stop attempt 16 for check run 123237672004 failed: foundation.url.protocol.sandbox.SandboxException: Sandboxed code threw an exception: java.lang.InternalError: Exception encountered in implementation of foundation/url/sjvm/intrinsics/ServiceBridge:rpc(Ljava/lang/String;Ljava/util/Map;)Ljava/util/Map; : foundation.url.resolver.UrlResolutionException: RPC request 'supersedeBuildRun' failed: RELAY_ERROR - Handler error: RPC error: INTERNAL_ERROR - Cannot supersede build run 'b9f6bf0f': it is already in terminal status FAILED. Only in-progress builds can be superseded. cause: null. The cancellation stays saved; retrying in 1920000ms.this service
2h 21m ago build remote stopCodexCoder21Organization/HandoffEmbeddedRemote stop attempt 15 for check run 123239424206 failed: foundation.url.protocol.sandbox.SandboxException: Sandboxed code threw an exception: java.lang.InternalError: Exception encountered in implementation of foundation/url/sjvm/intrinsics/ServiceBridge:rpc(Ljava/lang/String;Ljava/util/Map;)Ljava/util/Map; : foundation.url.resolver.UrlResolutionException: RPC request 'supersedeBuildRun' failed: RELAY_ERROR - Handler error: RPC error: INTERNAL_ERROR - Cannot supersede build run '24e8c23d': it is already in terminal status FAILED. Only in-progress builds can be superseded. cause: null. The cancellation stays saved; retrying in 1920000ms.this service
2h 22m ago build remote stopCodexCoder21Organization/HandoffEmbeddedRemote stop attempt 16 for check run 123237670992 failed: foundation.url.protocol.sandbox.SandboxException: Sandboxed code threw an exception: java.lang.InternalError: Exception encountered in implementation of foundation/url/sjvm/intrinsics/ServiceBridge:rpc(Ljava/lang/String;Ljava/util/Map;)Ljava/util/Map; : foundation.url.resolver.UrlResolutionException: RPC request 'supersedeBuildRun' failed: RELAY_ERROR - Handler error: RPC error: INTERNAL_ERROR - Cannot supersede build run '1824629e': it is already in terminal status FAILED. Only in-progress builds can be superseded. cause: null. The cancellation stays saved; retrying in 1920000ms.this service
2h 25m ago build remote stopCodexCoder21Organization/HandoffEmbeddedRemote stop attempt 28 for check run 121989746496 failed: java.lang.IllegalStateException: Remote build b138c117 was recorded as terminal before the required remote cancellation was confirmed, but its status read returned status FAILED; expected status CANCELED. Cancellation context: check run 121989746496, attempt generation 0; reason="pull request #18 was closed", bypassMessage=null, conclusion="cancelled", summary="PR #18 was closed, canceling the in-flight build for this pull request.", operationMode=CANCEL. The cancellation stays saved; retrying in 1920000ms.this service
2h 56m ago build remote stopCodexCoder21Organization/HandoffEmbeddedRemote stop attempt 7 for check run 123396951958 failed: foundation.url.protocol.sandbox.SandboxException: Sandboxed code threw an exception: java.lang.InternalError: Exception encountered in implementation of foundation/url/sjvm/intrinsics/ServiceBridge:rpc(Ljava/lang/String;Ljava/util/Map;)Ljava/util/Map; : foundation.url.resolver.UrlResolutionException: RPC request 'supersedeBuildRun' failed: RELAY_ERROR - Handler error: RPC error: INTERNAL_ERROR - Cannot supersede build run 'fa1c8dfe': it is already in terminal status FAILED. Only in-progress builds can be superseded. cause: null. The cancellation stays saved; retrying in 1920000ms.this service
2h 59m ago build remote stopCodexCoder21Organization/HandoffEmbeddedRemote stop attempt 8 for check run 123355709083 failed: foundation.url.protocol.sandbox.SandboxException: Sandboxed code threw an exception: java.lang.InternalError: Exception encountered in implementation of foundation/url/sjvm/intrinsics/ServiceBridge:rpc(Ljava/lang/String;Ljava/util/Map;)Ljava/util/Map; : foundation.url.resolver.UrlResolutionException: RPC request 'supersedeBuildRun' failed: RELAY_ERROR - Handler error: RPC error: INTERNAL_ERROR - Cannot supersede build run 'de2f0a80': it is already in terminal status FAILED. Only in-progress builds can be superseded. cause: null. The cancellation stays saved; retrying in 1920000ms.this service
2h 59m ago build remote stopCodexCoder21Organization/HandoffEmbeddedRemote stop attempt 16 for check run 123237637054 failed: foundation.url.protocol.sandbox.SandboxException: Sandboxed code threw an exception: java.lang.InternalError: Exception encountered in implementation of foundation/url/sjvm/intrinsics/ServiceBridge:rpc(Ljava/lang/String;Ljava/util/Map;)Ljava/util/Map; : foundation.url.resolver.UrlResolutionException: RPC request 'supersedeBuildRun' failed: RELAY_ERROR - Handler error: RPC error: INTERNAL_ERROR - Cannot supersede build run 'b0df4ab1': it is already in terminal status FAILED. Only in-progress builds can be superseded. cause: null. The cancellation stays saved; retrying in 1920000ms.this service
3h 0m ago build alignment deferredCodexCoder21Organization/HandoffEmbeddedCheck run 121989746496 is tracked and a cancellation already owns it, so the sweep left it to that path.this service
3h 4m ago build remote stopCodexCoder21Organization/HandoffEmbeddedRemote stop attempt 10 for check run 123302854390 failed: foundation.url.protocol.sandbox.SandboxException: Sandboxed code threw an exception: java.lang.InternalError: Exception encountered in implementation of foundation/url/sjvm/intrinsics/ServiceBridge:rpc(Ljava/lang/String;Ljava/util/Map;)Ljava/util/Map; : foundation.url.resolver.UrlResolutionException: RPC request 'supersedeBuildRun' failed: RELAY_ERROR - Handler error: RPC error: INTERNAL_ERROR - Cannot supersede build run '8b269094': it is already in terminal status FAILED. Only in-progress builds can be superseded. cause: null. The cancellation stays saved; retrying in 1920000ms.this service
3h 6m ago build remote stopCodexCoder21Organization/HandoffEmbeddedRemote stop attempt 11 for check run 123240542600 failed: foundation.url.protocol.sandbox.SandboxException: Sandboxed code threw an exception: java.lang.InternalError: Exception encountered in implementation of foundation/url/sjvm/intrinsics/ServiceBridge:rpc(Ljava/lang/String;Ljava/util/Map;)Ljava/util/Map; : foundation.url.resolver.UrlResolutionException: RPC request 'supersedeBuildRun' failed: RELAY_ERROR - Handler error: RPC error: INTERNAL_ERROR - Cannot supersede build run 'f264cca8': it is already in terminal status FAILED. Only in-progress builds can be superseded. cause: null. The cancellation stays saved; retrying in 1920000ms.this service
3h 8m ago build remote stopCodexCoder21Organization/HandoffEmbeddedRemote stop attempt 14 for check run 123239424206 failed: foundation.url.protocol.sandbox.SandboxException: Sandboxed code threw an exception: java.lang.InternalError: Exception encountered in implementation of foundation/url/sjvm/intrinsics/ServiceBridge:rpc(Ljava/lang/String;Ljava/util/Map;)Ljava/util/Map; : foundation.url.resolver.UrlResolutionException: RPC request 'supersedeBuildRun' failed: RELAY_ERROR - Handler error: RPC error: INTERNAL_ERROR - Cannot supersede build run '24e8c23d': it is already in terminal status FAILED. Only in-progress builds can be superseded. cause: null. The cancellation stays saved; retrying in 1920000ms.this service
3h 10m ago build remote stopCodexCoder21Organization/HandoffEmbeddedRemote stop attempt 15 for check run 123237672004 failed: foundation.url.protocol.sandbox.SandboxException: Sandboxed code threw an exception: java.lang.InternalError: Exception encountered in implementation of foundation/url/sjvm/intrinsics/ServiceBridge:rpc(Ljava/lang/String;Ljava/util/Map;)Ljava/util/Map; : foundation.url.resolver.UrlResolutionException: RPC request 'supersedeBuildRun' failed: RELAY_ERROR - Handler error: RPC error: INTERNAL_ERROR - Cannot supersede build run 'b9f6bf0f': it is already in terminal status FAILED. Only in-progress builds can be superseded. cause: null. The cancellation stays saved; retrying in 1920000ms.this service
3h 10m ago build remote stopCodexCoder21Organization/HandoffEmbeddedRemote stop attempt 15 for check run 123237670992 failed: foundation.url.protocol.sandbox.SandboxException: Sandboxed code threw an exception: java.lang.InternalError: Exception encountered in implementation of foundation/url/sjvm/intrinsics/ServiceBridge:rpc(Ljava/lang/String;Ljava/util/Map;)Ljava/util/Map; : foundation.url.resolver.UrlResolutionException: RPC request 'supersedeBuildRun' failed: RELAY_ERROR - Handler error: RPC error: INTERNAL_ERROR - Cannot supersede build run '1824629e': it is already in terminal status FAILED. Only in-progress builds can be superseded. cause: null. The cancellation stays saved; retrying in 1920000ms.this service
3h 13m ago build remote stopCodexCoder21Organization/HandoffEmbeddedRemote stop attempt 27 for check run 121989746496 failed: java.lang.IllegalStateException: Remote build b138c117 was recorded as terminal before the required remote cancellation was confirmed, but its status read returned status FAILED; expected status CANCELED. Cancellation context: check run 121989746496, attempt generation 0; reason="pull request #18 was closed", bypassMessage=null, conclusion="cancelled", summary="PR #18 was closed, canceling the in-flight build for this pull request.", operationMode=CANCEL. The cancellation stays saved; retrying in 1920000ms.this service
3h 24m ago build recovery failedCodexCoder21Organization/HandoffEmbeddedFailed to recover shadow check 123514100811: foundation.url.protocol.sandbox.SandboxException: Sandboxed code threw an exception: java.lang.InternalError: Exception encountered in implementation of foundation/url/sjvm/intrinsics/ServiceBridge:rpc(Ljava/lang/String;Ljava/util/Map;)Ljava/util/Map; : foundation.url.resolver.UrlResolutionException: RPC request 'cancelCiBuild' failed: INTERNAL_ERROR - RPC error: -1 - IllegalStateException: Cannot run CI operation 'cancelCiBuild' because the url://buildtest/ connection has not been established, and it did not come up within 20000ms of waiting. Retry once the server logs 'url://buildtest/ connection established; ingestion and CI orchestration enabled.' cause: null at foundation.url.resolver.sandbox.TypeMarshaling.fromJvmResult$foundation_url_resolver_sandbox(TypeMarshaling.kt:692) at foundation.url.resolver.sandbox.InstanceMethodDispatcher$invokeWithActivity$3.invoke(SandboxedProxyGenerator.kt:2106) at foundation.url.resolver.sandbox.InstanceMethodDispatcher$invokeWithActivity$3.invoke(SandboxedProxyGenerator.kt:2037) at foundation.url.resolver.sandbox.SandboxedProxyGeneratorKt$invokeSandboxMethod$future$1$result$1.invoke(SandboxedProxyGenerator.kt:1491) at community.kotlin.clocks.hierarchical.RequiredClockPadKt.withRequiredClockPad(RequiredClockPad.kt:89) at foundation.url.resolver.sandbox.SandboxedProxyGeneratorKt.invokeSandboxMethod$lambda$4(SandboxedProxyGenerator.kt:1491) at java.base/java.util.concurrent.FutureTask.run(FutureTask.java:317) at foundation.url.resolver.sandbox.SandboxInvocationLane.runScheduled(SandboxedProxyGenerator.kt:1379) at foundation.url.resolver.sandbox.SandboxInvocationLane.schedule$lambda$5(SandboxedProxyGenerator.kt:1370) at java.base/java.util.concurrent.ThreadPoolExecutor.runWorker(ThreadPoolExecutor.java:1144) at java.base/java.util.concurrent.ThreadPoolExecutor$Worker.run(ThreadPoolExecutor.java:642) at java.base/java.lang.Thread.run(Thread.java:1583) Suppressed: foundation.url.protocol.sandbox.SandboxException: Sandboxed code threw an exception: java.lang.InternalError: Exception encountered in implementation of foundation/url/sjvm/intrinsics/ServiceBridge:rpc(Ljava/lang/String;Ljava/util/Map;)Ljava/util/Map; : foundation.url.resolver.UrlResolutionException: RPC request 'getCiBuild' failed: INTERNAL_ERROR - RPC error: -1 - IllegalStateException: Cannot run CI operation 'getCiBuild' because the url://buildtest/ connection has not been established, and it did not come up within 20000ms of waiting. Retry once the server logs 'url://buildtest/ connection established; ingestion and CI orchestration enabled.' cause: null ... 12 more Caused by: java.lang.RuntimeException: java.lang.InternalError: Exception encountered in implementation of foundation/url/sjvm/intrinsics/ServiceBridge:rpc(Ljava/lang/String;Ljava/util/Map;)Ljava/util/Map; : foundation.url.resolver.UrlResolutionException: RPC request 'getCiBuild' failed: INTERNAL_ERROR - RPC error: -1 - IllegalStateException: Cannot run CI operation 'getCiBuild' because the url://buildtest/ connection has not been established, and it did not come up within 20000ms of waiting. Retry once the server logs 'url://buildtest/ connection established; ingestion and CI orchestration enabled.' at foundation.url.resolver.sandbox.TypeMarshaling.fromJvmResult$foundation_url_resolver_sandbox(TypeMarshaling.kt:695) ... 11 more Suppressed: java.lang.IllegalStateException: Remote termination proof read failed for check run 123514100811, remote run 699203db-0819-4ccc-b2a0-4a3b9930bd88, attempt generation 0; expected reason="build exceeded its overall deadline while deferred", bypassMessage=null, conclusion="failure", summary="Build never started because the runner was saturated: every build worker was already running a check. It waited 141366s in the deferred queue before the existing local deferred-submission deadline expired.\n\nBuild exceeded its local deferred-submission deadline of 180 minutes after 147562s elapsed since submission. No remote buildtest run was admitted. The local queue deadline survives service restarts.", operationMode=LOCAL_RESULT, proof any terminal status. The remote operation failed with foundation.url.protocol.sandbox.SandboxException: Sandboxed code threw an exception: java.lang.InternalError: Exception encountered in implementation of foundation/url/sjvm/intrinsics/ServiceBridge:rpc(Ljava/lang/String;Ljava/util/Map;)Ljava/util/Map; : foundation.url.resolver.UrlResolutionException: RPC request 'cancelCiBuild' failed: INTERNAL_ERROR - RPC error: -1 - IllegalStateException: Cannot run CI operation 'cancelCiBuild' because the url://buildtest/ connection has not been established, and it did not come up within 20000ms of waiting. Retry once the server logs 'url://buildtest/ connection established; ingestion and CI orchestration enabled.' cause: null; getBuildRun then failed with foundation.url.protocol.sandbox.SandboxException: Sandboxed code threw an exception: java.lang.InternalError: Exception encountered in implementation of foundation/url/sjvm/intrinsics/ServiceBridge:rpc(Ljava/lang/String;Ljava/util/Map;)Ljava/util/Map; : foundation.url.resolver.UrlResolutionException: RPC request 'getCiBuild' failed: INTERNAL_ERROR - RPC error: -1 - IllegalStateException: Cannot run CI operation 'getCiBuild' because the url://buildtest/ connection has not been established, and it did not come up within 20000ms of waiting. Retry once the server logs 'url://buildtest/ connection established; ingestion and CI orchestration enabled.' cause: null. at org.example.ci.BuildRunner.reconcileRemoteRunTermination(BuildRunner.kt:4204) at org.example.ci.BuildRunner.requestRemoteRunTermination(BuildRunner.kt:4026) at org.example.ci.BuildRunner.requestRemoteRunTermination$default(BuildRunner.kt:4002) at org.example.ci.BuildRunner.cancelAllRemoteRuns(BuildRunner.kt:3961) at org.example.ci.BuildRunner.cancelAllRemoteRuns$default(BuildRunner.kt:3882) at org.example.ci.BuildRunner.cancelBuildsForRepo$lambda$251(BuildRunner.kt:5802) at org.example.ci.BuildRunner.withCheckOperation(BuildRunner.kt:2143) at org.example.ci.BuildRunner.cancelBuildsForRepo(BuildRunner.kt:5668) at org.example.ci.BuildRunner.cancelBuildsForRepo$default(BuildRunner.kt:5362) at org.example.ci.BuildRunner.cancelRemoteRunsBeforeOwnedCompletion(BuildRunner.kt:5307) at org.example.ci.BuildRunner.cancelRemoteRunsBeforeOwnedCompletion$default(BuildRunner.kt:5251) at org.example.ci.BuildRunner.completeDeferredDeadline(BuildRunner.kt:4675) at org.example.ci.BuildRunner.resumeBuildAsRecovery(BuildRunner.kt:8057) at org.example.ci.BuildRunner.resumeBuildAsRecovery$default(BuildRunner.kt:7853) at org.example.ci.BuildRunner.resumeBuildWithOutcome$lambda$331(BuildRunner.kt:7843) at org.example.ci.BuildRunner.withSandboxRpcWorkClass(BuildRunner.kt:2447) at org.example.ci.BuildRunner.resumeBuildWithOutcome(BuildRunner.kt:7797) at org.example.ci.BuildRunner.resumeBuildWithOutcome$default(BuildRunner.kt:7797) at org.example.ci.BuildRunner.resumeBuild$org_example_ci(BuildRunner.kt:7796) at org.example.ci.BuildRunner.recoverPersistedDeferredBuilds(BuildRunner.kt:3877) at org.example.ci.CiServiceStartup.recoverBuilds(CiServiceStartup.kt:91) at org.example.ci.CiServiceAssembly.start$lambda$3(Main.kt:1009) at org.example.ci.CiServiceStartup.start(CiServiceStartup.kt:80) at org.example.ci.CiServiceAssembly.start(Main.kt:1059) at org.example.ci.MainKt.main(Main.kt:810) at org.example.ci.MainKt.main(Main.kt) Caused by: java.lang.RuntimeException: java.lang.InternalError: Exception encountered in implementation of foundation/url/sjvm/intrinsics/ServiceBridge:rpc(Ljava/lang/String;Ljava/util/Map;)Ljava/util/Map; : foundation.url.resolver.UrlResolutionException: RPC request 'cancelCiBuild' failed: INTERNAL_ERROR - RPC error: -1 - IllegalStateException: Cannot run CI operation 'cancelCiBuild' because the url://buildtest/ connection has not been established, and it did not come up within 20000ms of waiting. Retry once the server logs 'url://buildtest/ connection established; ingestion and CI orchestration enabled.' at foundation.url.resolver.sandbox.TypeMarshaling.fromJvmResult$foundation_url_resolver_sandbox(TypeMarshaling.kt:695) ... 11 more this service
3h 40m ago build remote stopCodexCoder21Organization/HandoffEmbeddedRemote stop attempt 6 for check run 123396951958 failed: foundation.url.protocol.sandbox.SandboxException: Sandboxed code threw an exception: java.lang.InternalError: Exception encountered in implementation of foundation/url/sjvm/intrinsics/ServiceBridge:rpc(Ljava/lang/String;Ljava/util/Map;)Ljava/util/Map; : foundation.url.resolver.UrlResolutionException: RPC request 'supersedeBuildRun' failed: INTERNAL_ERROR - RPC error: INTERNAL_ERROR - Cannot supersede build run 'fa1c8dfe': it is already in terminal status FAILED. Only in-progress builds can be superseded. cause: null. The cancellation stays saved; retrying in 1920000ms.this service
3h 46m ago build remote stopCodexCoder21Organization/HandoffEmbeddedRemote stop attempt 9 for check run 123302854390 failed: foundation.url.protocol.sandbox.SandboxException: Sandboxed code threw an exception: java.lang.InternalError: Exception encountered in implementation of foundation/url/sjvm/intrinsics/ServiceBridge:rpc(Ljava/lang/String;Ljava/util/Map;)Ljava/util/Map; : foundation.url.resolver.UrlResolutionException: RPC request 'supersedeBuildRun' failed: INTERNAL_ERROR - RPC error: INTERNAL_ERROR - Cannot supersede build run '8b269094': it is already in terminal status FAILED. Only in-progress builds can be superseded. cause: null. The cancellation stays saved; retrying in 1920000ms.this service
3h 52m ago build remote stopCodexCoder21Organization/HandoffEmbeddedRemote stop attempt 7 for check run 123355709083 failed: foundation.url.protocol.sandbox.SandboxException: Sandboxed code threw an exception: java.lang.InternalError: Exception encountered in implementation of foundation/url/sjvm/intrinsics/ServiceBridge:rpc(Ljava/lang/String;Ljava/util/Map;)Ljava/util/Map; : foundation.url.resolver.UrlResolutionException: RPC request 'supersedeBuildRun' failed: INTERNAL_ERROR - RPC error: INTERNAL_ERROR - Cannot supersede build run 'de2f0a80': it is already in terminal status FAILED. Only in-progress builds can be superseded. cause: null. The cancellation stays saved; retrying in 1920000ms.this service
3h 52m ago build remote stopCodexCoder21Organization/HandoffEmbeddedRemote stop attempt 10 for check run 123240542600 failed: foundation.url.protocol.sandbox.SandboxException: Sandboxed code threw an exception: java.lang.InternalError: Exception encountered in implementation of foundation/url/sjvm/intrinsics/ServiceBridge:rpc(Ljava/lang/String;Ljava/util/Map;)Ljava/util/Map; : foundation.url.resolver.UrlResolutionException: RPC request 'supersedeBuildRun' failed: INTERNAL_ERROR - RPC error: INTERNAL_ERROR - Cannot supersede build run 'f264cca8': it is already in terminal status FAILED. Only in-progress builds can be superseded. cause: null. The cancellation stays saved; retrying in 1920000ms.this service
3h 58m ago build remote stopCodexCoder21Organization/HandoffEmbeddedRemote stop attempt 14 for check run 123237672004 failed: foundation.url.protocol.sandbox.SandboxException: Sandboxed code threw an exception: java.lang.InternalError: Exception encountered in implementation of foundation/url/sjvm/intrinsics/ServiceBridge:rpc(Ljava/lang/String;Ljava/util/Map;)Ljava/util/Map; : foundation.url.resolver.UrlResolutionException: RPC request 'supersedeBuildRun' failed: INTERNAL_ERROR - RPC error: INTERNAL_ERROR - Cannot supersede build run 'b9f6bf0f': it is already in terminal status FAILED. Only in-progress builds can be superseded. cause: null. The cancellation stays saved; retrying in 1920000ms.this service
3h 59m ago build remote stopCodexCoder21Organization/HandoffEmbeddedRemote stop attempt 15 for check run 123237637054 failed: foundation.url.protocol.sandbox.SandboxException: Sandboxed code threw an exception: java.lang.InternalError: Exception encountered in implementation of foundation/url/sjvm/intrinsics/ServiceBridge:rpc(Ljava/lang/String;Ljava/util/Map;)Ljava/util/Map; : foundation.url.resolver.UrlResolutionException: RPC request 'supersedeBuildRun' failed: INTERNAL_ERROR - RPC error: INTERNAL_ERROR - Cannot supersede build run 'b0df4ab1': it is already in terminal status FAILED. Only in-progress builds can be superseded. cause: null. The cancellation stays saved; retrying in 1920000ms.this service
4h 1m ago build remote stopCodexCoder21Organization/HandoffEmbeddedRemote stop attempt 13 for check run 123239424206 failed: foundation.url.protocol.sandbox.SandboxException: Sandboxed code threw an exception: java.lang.InternalError: Exception encountered in implementation of foundation/url/sjvm/intrinsics/ServiceBridge:rpc(Ljava/lang/String;Ljava/util/Map;)Ljava/util/Map; : foundation.url.resolver.UrlResolutionException: RPC request 'supersedeBuildRun' failed: INTERNAL_ERROR - RPC error: INTERNAL_ERROR - Cannot supersede build run '24e8c23d': it is already in terminal status FAILED. Only in-progress builds can be superseded. cause: null. The cancellation stays saved; retrying in 1920000ms.this service
4h 4m ago build remote stopCodexCoder21Organization/HandoffEmbeddedRemote stop attempt 26 for check run 121989746496 failed: java.lang.IllegalStateException: Remote build b138c117 was recorded as terminal before the required remote cancellation was confirmed, but its status read returned status FAILED; expected status CANCELED. Cancellation context: check run 121989746496, attempt generation 0; reason="pull request #18 was closed", bypassMessage=null, conclusion="cancelled", summary="PR #18 was closed, canceling the in-flight build for this pull request.", operationMode=CANCEL. The cancellation stays saved; retrying in 1920000ms.this service
4h 4m ago build remote stopCodexCoder21Organization/HandoffEmbeddedRemote stop attempt 14 for check run 123237670992 failed: foundation.url.protocol.sandbox.SandboxException: Sandboxed code threw an exception: java.lang.InternalError: Exception encountered in implementation of foundation/url/sjvm/intrinsics/ServiceBridge:rpc(Ljava/lang/String;Ljava/util/Map;)Ljava/util/Map; : foundation.url.resolver.UrlResolutionException: RPC request 'supersedeBuildRun' failed: INTERNAL_ERROR - RPC error: INTERNAL_ERROR - Cannot supersede build run '1824629e': it is already in terminal status FAILED. Only in-progress builds can be superseded. cause: null. The cancellation stays saved; retrying in 1920000ms.this service
4h 41m ago deliveryCodexCoder21Organization/HandoffEmbeddedGitHub delivered check_run.completed for CodexCoder21Organization/HandoffEmbedded.codexcoder21
4h 41m ago deliveryCodexCoder21Organization/HandoffEmbeddedGitHub delivered check_suite.completed for CodexCoder21Organization/HandoffEmbedded.codexcoder21
4h 51m ago deliveryCodexCoder21Organization/HandoffEmbeddedGitHub delivered check_run.completed for CodexCoder21Organization/HandoffEmbedded.codexcoder21
4h 51m ago deliveryCodexCoder21Organization/HandoffEmbeddedGitHub delivered check_suite.completed for CodexCoder21Organization/HandoffEmbedded.codexcoder21
4h 51m ago deliveryCodexCoder21Organization/HandoffEmbeddedGitHub delivered check_run.completed for CodexCoder21Organization/HandoffEmbedded.codexcoder21
4h 51m ago deliveryCodexCoder21Organization/HandoffEmbeddedGitHub delivered check_suite.completed for CodexCoder21Organization/HandoffEmbedded.codexcoder21
4h 51m ago completedCodexCoder21Organization/HandoffEmbeddedBuild never started because the runner was saturated: every build worker was already running a check. It waited 0s in the deferred queue before the existing local deferred-submission deadline expired.this service
4h 51m ago completedCodexCoder21Organization/HandoffEmbeddedBuild never started because the runner was saturated: every build worker was already running a check. It waited 0s in the deferred queue before the existing local deferred-submission deadline expired.this service
5h 9m ago build remote stopCodexCoder21Organization/HandoffEmbeddedRemote stop attempt 6 for check run 123355709083 failed: foundation.url.protocol.sandbox.SandboxException: Sandboxed code threw an exception: java.lang.InternalError: Exception encountered in implementation of foundation/url/sjvm/intrinsics/ServiceBridge:rpc(Ljava/lang/String;Ljava/util/Map;)Ljava/util/Map; : foundation.url.resolver.UrlResolutionException: RPC request 'supersedeBuildRun' failed: INTERNAL_ERROR - RPC error: INTERNAL_ERROR - Cannot supersede build run 'de2f0a80': it is already in terminal status FAILED. Only in-progress builds can be superseded. cause: null. The cancellation stays saved; retrying in 1920000ms.this service
5h 16m ago build remote stopCodexCoder21Organization/HandoffEmbeddedRemote stop attempt 12 for check run 123239424206 failed: foundation.url.protocol.sandbox.SandboxException: Sandboxed code threw an exception: java.lang.InternalError: Exception encountered in implementation of foundation/url/sjvm/intrinsics/ServiceBridge:rpc(Ljava/lang/String;Ljava/util/Map;)Ljava/util/Map; : foundation.url.resolver.UrlResolutionException: RPC request 'supersedeBuildRun' failed: INTERNAL_ERROR - RPC error: INTERNAL_ERROR - Cannot supersede build run '24e8c23d': it is already in terminal status FAILED. Only in-progress builds can be superseded. cause: null. The cancellation stays saved; retrying in 1920000ms.this service
5h 22m ago build remote stopCodexCoder21Organization/HandoffEmbeddedRemote stop attempt 13 for check run 123237672004 failed: foundation.url.protocol.sandbox.SandboxException: Sandboxed code threw an exception: java.lang.InternalError: Exception encountered in implementation of foundation/url/sjvm/intrinsics/ServiceBridge:rpc(Ljava/lang/String;Ljava/util/Map;)Ljava/util/Map; : foundation.url.resolver.UrlResolutionException: RPC request 'supersedeBuildRun' failed: INTERNAL_ERROR - RPC error: INTERNAL_ERROR - Cannot supersede build run 'b9f6bf0f': it is already in terminal status FAILED. Only in-progress builds can be superseded. cause: null. The cancellation stays saved; retrying in 1920000ms.this service
5h 22m ago build remote stopCodexCoder21Organization/HandoffEmbeddedRemote stop attempt 25 for check run 121989746496 failed: java.lang.IllegalStateException: Remote build b138c117 was recorded as terminal before the required remote cancellation was confirmed, but its status read returned status FAILED; expected status CANCELED. Cancellation context: check run 121989746496, attempt generation 0; reason="pull request #18 was closed", bypassMessage=null, conclusion="cancelled", summary="PR #18 was closed, canceling the in-flight build for this pull request.", operationMode=CANCEL. The cancellation stays saved; retrying in 1920000ms.this service
5h 22m ago build remote stopCodexCoder21Organization/HandoffEmbeddedRemote stop attempt 13 for check run 123237670992 failed: foundation.url.protocol.sandbox.SandboxException: Sandboxed code threw an exception: java.lang.InternalError: Exception encountered in implementation of foundation/url/sjvm/intrinsics/ServiceBridge:rpc(Ljava/lang/String;Ljava/util/Map;)Ljava/util/Map; : foundation.url.resolver.UrlResolutionException: RPC request 'supersedeBuildRun' failed: INTERNAL_ERROR - RPC error: INTERNAL_ERROR - Cannot supersede build run '1824629e': it is already in terminal status FAILED. Only in-progress builds can be superseded. cause: null. The cancellation stays saved; retrying in 1920000ms.this service
5h 24m ago build remote stopCodexCoder21Organization/HandoffEmbeddedRemote stop attempt 5 for check run 123396951958 failed: foundation.url.protocol.sandbox.SandboxException: Sandboxed code threw an exception: java.lang.InternalError: Exception encountered in implementation of foundation/url/sjvm/intrinsics/ServiceBridge:rpc(Ljava/lang/String;Ljava/util/Map;)Ljava/util/Map; : foundation.url.resolver.UrlResolutionException: RPC request 'supersedeBuildRun' failed: INTERNAL_ERROR - RPC error: INTERNAL_ERROR - Cannot supersede build run 'fa1c8dfe': it is already in terminal status FAILED. Only in-progress builds can be superseded. cause: null. The cancellation stays saved; retrying in 960000ms.this service
5h 26m ago build remote stopCodexCoder21Organization/HandoffEmbeddedRemote stop attempt 14 for check run 123237637054 failed: foundation.url.protocol.sandbox.SandboxException: Sandboxed code threw an exception: java.lang.InternalError: Exception encountered in implementation of foundation/url/sjvm/intrinsics/ServiceBridge:rpc(Ljava/lang/String;Ljava/util/Map;)Ljava/util/Map; : foundation.url.resolver.UrlResolutionException: RPC request 'supersedeBuildRun' failed: INTERNAL_ERROR - RPC error: INTERNAL_ERROR - Cannot supersede build run 'b0df4ab1': it is already in terminal status FAILED. Only in-progress builds can be superseded. cause: null. The cancellation stays saved; retrying in 1920000ms.this service
5h 30m ago build remote stopCodexCoder21Organization/HandoffEmbeddedRemote stop attempt 9 for check run 123240542600 failed: foundation.url.protocol.sandbox.SandboxException: Sandboxed code threw an exception: java.lang.InternalError: Exception encountered in implementation of foundation/url/sjvm/intrinsics/ServiceBridge:rpc(Ljava/lang/String;Ljava/util/Map;)Ljava/util/Map; : foundation.url.resolver.UrlResolutionException: RPC request 'supersedeBuildRun' failed: INTERNAL_ERROR - RPC error: INTERNAL_ERROR - Cannot supersede build run 'f264cca8': it is already in terminal status FAILED. Only in-progress builds can be superseded. cause: null. The cancellation stays saved; retrying in 1920000ms.this service
6h 18m ago build remote stopCodexCoder21Organization/HandoffEmbeddedRemote stop attempt 11 for check run 123239424206 failed: foundation.url.protocol.sandbox.SandboxException: Sandboxed code threw an exception: java.lang.InternalError: Exception encountered in implementation of foundation/url/sjvm/intrinsics/ServiceBridge:rpc(Ljava/lang/String;Ljava/util/Map;)Ljava/util/Map; : foundation.url.resolver.UrlResolutionException: RPC request 'supersedeBuildRun' failed: INTERNAL_ERROR - RPC error: INTERNAL_ERROR - Cannot supersede build run '24e8c23d': it is already in terminal status FAILED. Only in-progress builds can be superseded. cause: null. The cancellation stays saved; retrying in 1920000ms.this service
6h 25m ago build remote stopCodexCoder21Organization/HandoffEmbeddedRemote stop attempt 5 for check run 123355709083 failed: foundation.url.protocol.sandbox.SandboxException: Sandboxed code threw an exception: java.lang.InternalError: Exception encountered in implementation of foundation/url/sjvm/intrinsics/ServiceBridge:rpc(Ljava/lang/String;Ljava/util/Map;)Ljava/util/Map; : foundation.url.resolver.UrlResolutionException: RPC request 'supersedeBuildRun' failed: INTERNAL_ERROR - RPC error: INTERNAL_ERROR - Cannot supersede build run 'de2f0a80': it is already in terminal status FAILED. Only in-progress builds can be superseded. cause: null. The cancellation stays saved; retrying in 960000ms.this service
6h 31m ago deliveryCodexCoder21Organization/HandoffEmbeddedGitHub delivered check_run.completed for CodexCoder21Organization/HandoffEmbedded.codexcoder21
6h 31m ago deliveryCodexCoder21Organization/HandoffEmbeddedGitHub delivered check_suite.completed for CodexCoder21Organization/HandoffEmbedded.codexcoder21
6h 31m ago completedCodexCoder21Organization/HandoffEmbeddedBuild failed: 293 passed, 3 failed, 296 totalthis service
6h 47m ago build remote stopCodexCoder21Organization/HandoffEmbeddedRemote stop attempt 8 for check run 123302854390 failed: foundation.url.protocol.sandbox.SandboxException: Sandboxed code threw an exception: java.lang.InternalError: Exception encountered in implementation of foundation/url/sjvm/intrinsics/ServiceBridge:rpc(Ljava/lang/String;Ljava/util/Map;)Ljava/util/Map; : foundation.url.resolver.UrlResolutionException: RPC request 'supersedeBuildRun' failed: INTERNAL_ERROR - RPC error: INTERNAL_ERROR - Cannot supersede build run '8b269094': it is already in terminal status FAILED. Only in-progress builds can be superseded. cause: null. The cancellation stays saved; retrying in 1920000ms.this service
6h 49m ago build remote stopCodexCoder21Organization/HandoffEmbeddedRemote stop attempt 4 for check run 123396951958 failed: foundation.url.protocol.sandbox.SandboxException: Sandboxed code threw an exception: java.lang.InternalError: Exception encountered in implementation of foundation/url/sjvm/intrinsics/ServiceBridge:rpc(Ljava/lang/String;Ljava/util/Map;)Ljava/util/Map; : foundation.url.resolver.UrlResolutionException: RPC request 'supersedeBuildRun' failed: INTERNAL_ERROR - RPC error: INTERNAL_ERROR - Cannot supersede build run 'fa1c8dfe': it is already in terminal status FAILED. Only in-progress builds can be superseded. cause: null. The cancellation stays saved; retrying in 480000ms.this service
6h 49m ago deliveryCodexCoder21Organization/HandoffEmbeddedGitHub delivered check_suite.completed for CodexCoder21Organization/HandoffEmbedded.codexcoder21
6h 49m ago deliveryCodexCoder21Organization/HandoffEmbeddedGitHub delivered check_run.completed for CodexCoder21Organization/HandoffEmbedded.codexcoder21
6h 49m ago completedCodexCoder21Organization/HandoffEmbeddedBuild failed: 294 passed, 2 failed, 296 totalthis service
6h 53m ago build pendingCodexCoder21Organization/HandoffEmbeddedRemote run 97f5604a remains PENDING after 225550s of queue wait; waiting for buildtest admission.this service
6h 56m ago deliveryCodexCoder21Organization/HandoffEmbeddedGitHub delivered check_run.completed for CodexCoder21Organization/HandoffEmbedded.codexcoder21
6h 56m ago completedCodexCoder21Organization/HandoffEmbeddedBuild failed: 293 passed, 3 failed, 296 totalthis service
6h 58m ago build pendingCodexCoder21Organization/HandoffEmbeddedRemote run 97f5604a remains PENDING after 225206s of queue wait; waiting for buildtest admission.this service
6h 59m ago build remote stopCodexCoder21Organization/HandoffEmbeddedRemote stop attempt 24 for check run 121989746496 failed: java.lang.IllegalStateException: Remote build b138c117 was recorded as terminal before the required remote cancellation was confirmed, but its status read returned status FAILED; expected status CANCELED. Cancellation context: check run 121989746496, attempt generation 0; reason="pull request #18 was closed", bypassMessage=null, conclusion="cancelled", summary="PR #18 was closed, canceling the in-flight build for this pull request.", operationMode=CANCEL. The cancellation stays saved; retrying in 1920000ms.this service
7h 2m ago build remote stopCodexCoder21Organization/HandoffEmbeddedRemote stop attempt 12 for check run 123237670992 failed: foundation.url.protocol.sandbox.SandboxException: Sandboxed code threw an exception: java.lang.InternalError: Exception encountered in implementation of foundation/url/sjvm/intrinsics/ServiceBridge:rpc(Ljava/lang/String;Ljava/util/Map;)Ljava/util/Map; : foundation.url.resolver.UrlResolutionException: RPC request 'supersedeBuildRun' failed: INTERNAL_ERROR - RPC error: INTERNAL_ERROR - Cannot supersede build run '1824629e': it is already in terminal status FAILED. Only in-progress builds can be superseded. cause: null. The cancellation stays saved; retrying in 1920000ms.this service
7h 5m ago build remote stopCodexCoder21Organization/HandoffEmbeddedRemote stop attempt 4 for check run 123355709083 failed: foundation.url.protocol.sandbox.SandboxException: Sandboxed code threw an exception: java.lang.InternalError: Exception encountered in implementation of foundation/url/sjvm/intrinsics/ServiceBridge:rpc(Ljava/lang/String;Ljava/util/Map;)Ljava/util/Map; : foundation.url.resolver.UrlResolutionException: RPC request 'supersedeBuildRun' failed: INTERNAL_ERROR - RPC error: INTERNAL_ERROR - Cannot supersede build run 'de2f0a80': it is already in terminal status FAILED. Only in-progress builds can be superseded. cause: null. The cancellation stays saved; retrying in 480000ms.this service
7h 6m ago deliveryCodexCoder21Organization/HandoffEmbeddedGitHub delivered check_suite.completed for CodexCoder21Organization/HandoffEmbedded.codexcoder21
7h 6m ago deliveryCodexCoder21Organization/HandoffEmbeddedGitHub delivered check_run.completed for CodexCoder21Organization/HandoffEmbedded.codexcoder21
7h 6m ago completedCodexCoder21Organization/HandoffEmbeddedBuild never started because the runner was saturated: every build worker was already running a check. It waited 0s in the deferred queue before the existing local deferred-submission deadline expired.this service
7h 6m ago deliveryCodexCoder21Organization/HandoffEmbeddedGitHub delivered check_run.completed for CodexCoder21Organization/HandoffEmbedded.codexcoder21
7h 6m ago completedCodexCoder21Organization/HandoffEmbeddedBuild never started because the runner was saturated: every build worker was already running a check. It waited 59s in the deferred queue before the existing local deferred-submission deadline expired.this service
7h 7m ago deliveryCodexCoder21Organization/HandoffEmbeddedGitHub delivered check_run.completed for CodexCoder21Organization/HandoffEmbedded.codexcoder21
7h 7m ago deliveryCodexCoder21Organization/HandoffEmbeddedGitHub delivered check_suite.completed for CodexCoder21Organization/HandoffEmbedded.codexcoder21
7h 7m ago completedCodexCoder21Organization/HandoffEmbeddedBuild never started because the runner was saturated: every build worker was already running a check. It waited 98s in the deferred queue before the existing local deferred-submission deadline expired.this service
7h 7m ago deliveryCodexCoder21Organization/HandoffEmbeddedGitHub delivered check_run.completed for CodexCoder21Organization/HandoffEmbedded.codexcoder21
7h 7m ago completedCodexCoder21Organization/HandoffEmbeddedBuild never started because the runner was saturated: every build worker was already running a check. It waited 293s in the deferred queue before the existing local deferred-submission deadline expired.this service
7h 9m ago deliveryCodexCoder21Organization/HandoffEmbeddedGitHub delivered check_run.completed for CodexCoder21Organization/HandoffEmbedded.codexcoder21
7h 9m ago completedCodexCoder21Organization/HandoffEmbeddedBuild never started because the runner was saturated: every build worker was already running a check. It waited 237s in the deferred queue before the existing local deferred-submission deadline expired.this service
7h 13m ago build pendingCodexCoder21Organization/HandoffEmbeddedRemote run 97f5604a remains PENDING after 224311s of queue wait; waiting for buildtest admission.this service
7h 26m ago deliveryCodexCoder21Organization/HandoffEmbeddedGitHub delivered check_run.completed for CodexCoder21Organization/HandoffEmbedded.codexcoder21
7h 26m ago completedCodexCoder21Organization/HandoffEmbeddedBuild never started because the runner was saturated: every build worker was already running a check. It waited 4s in the deferred queue before the existing local deferred-submission deadline expired.this service
7h 26m ago build pendingCodexCoder21Organization/HandoffEmbeddedRemote run 97f5604a remains PENDING after 223533s of queue wait; waiting for buildtest admission.this service
7h 26m ago deliveryCodexCoder21Organization/HandoffEmbeddedGitHub delivered check_run.completed for CodexCoder21Organization/HandoffEmbedded.codexcoder21
7h 26m ago completedCodexCoder21Organization/HandoffEmbeddedBuild never started because the runner was saturated: every build worker was already running a check. It waited 0s in the deferred queue before the existing local deferred-submission deadline expired.this service
7h 28m ago deliveryCodexCoder21Organization/HandoffEmbeddedGitHub delivered check_run.completed for CodexCoder21Organization/HandoffEmbedded.codexcoder21
7h 28m ago completedCodexCoder21Organization/HandoffEmbeddedBuild never started because the runner was saturated: every build worker was already running a check. It waited 2s in the deferred queue before the existing local deferred-submission deadline expired.this service
7h 28m ago deliveryCodexCoder21Organization/HandoffEmbeddedGitHub delivered check_run.completed for CodexCoder21Organization/HandoffEmbedded.codexcoder21
7h 28m ago deliveryCodexCoder21Organization/HandoffEmbeddedGitHub delivered check_suite.completed for CodexCoder21Organization/HandoffEmbedded.codexcoder21
7h 28m ago completedCodexCoder21Organization/HandoffEmbeddedBuild never started because the runner was saturated: every build worker was already running a check. It waited 0s in the deferred queue before the existing local deferred-submission deadline expired.this service
7h 28m ago build pendingCodexCoder21Organization/HandoffEmbeddedRemote run 5ad6554b remains PENDING after 225133s of queue wait; waiting for buildtest admission.this service
7h 28m ago build pendingCodexCoder21Organization/HandoffEmbeddedRemote run 8fc1a1df remains PENDING after 225792s of queue wait; waiting for buildtest admission.this service
7h 28m ago deliveryCodexCoder21Organization/HandoffEmbeddedGitHub delivered check_run.completed for CodexCoder21Organization/HandoffEmbedded.codexcoder21
7h 28m ago completedCodexCoder21Organization/HandoffEmbeddedBuild never started because the runner was saturated: every build worker was already running a check. It waited 0s in the deferred queue before the existing local deferred-submission deadline expired.this service
7h 29m ago build remote stopCodexCoder21Organization/HandoffEmbeddedRemote stop attempt 3 for check run 123396951958 failed: foundation.url.protocol.sandbox.SandboxException: Sandboxed code threw an exception: java.lang.InternalError: Exception encountered in implementation of foundation/url/sjvm/intrinsics/ServiceBridge:rpc(Ljava/lang/String;Ljava/util/Map;)Ljava/util/Map; : foundation.url.resolver.UrlResolutionException: RPC request 'supersedeBuildRun' failed: INTERNAL_ERROR - RPC error: INTERNAL_ERROR - Cannot supersede build run 'fa1c8dfe': it is already in terminal status FAILED. Only in-progress builds can be superseded. cause: null. The cancellation stays saved; retrying in 240000ms.this service
7h 31m ago deliveryCodexCoder21Organization/HandoffEmbeddedGitHub delivered check_run.completed for CodexCoder21Organization/HandoffEmbedded.codexcoder21
7h 31m ago deliveryCodexCoder21Organization/HandoffEmbeddedGitHub delivered check_suite.completed for CodexCoder21Organization/HandoffEmbedded.codexcoder21
7h 31m ago completedCodexCoder21Organization/HandoffEmbeddedBuild never started because the runner was saturated: every build worker was already running a check. It waited 3s in the deferred queue before the existing local deferred-submission deadline expired.this service
7h 32m ago deliveryCodexCoder21Organization/HandoffEmbeddedGitHub delivered check_run.completed for CodexCoder21Organization/HandoffEmbedded.codexcoder21
7h 32m ago completedCodexCoder21Organization/HandoffEmbeddedBuild never started because the runner was saturated: every build worker was already running a check. It waited 11s in the deferred queue before the existing local deferred-submission deadline expired.this service
7h 32m ago deliveryCodexCoder21Organization/HandoffEmbeddedGitHub delivered check_run.completed for CodexCoder21Organization/HandoffEmbedded.codexcoder21
7h 32m ago deliveryCodexCoder21Organization/HandoffEmbeddedGitHub delivered check_suite.completed for CodexCoder21Organization/HandoffEmbedded.codexcoder21
7h 32m ago completedCodexCoder21Organization/HandoffEmbeddedBuild never started because the runner was saturated: every build worker was already running a check. It waited 59s in the deferred queue before the existing local deferred-submission deadline expired.this service
7h 34m ago build pendingCodexCoder21Organization/HandoffEmbeddedRemote run 5ad6554b remains PENDING after 224822s of queue wait; waiting for buildtest admission.this service
7h 35m ago deliveryCodexCoder21Organization/HandoffEmbeddedGitHub delivered check_run.completed for CodexCoder21Organization/HandoffEmbedded.codexcoder21
7h 35m ago deliveryCodexCoder21Organization/HandoffEmbeddedGitHub delivered check_suite.completed for CodexCoder21Organization/HandoffEmbedded.codexcoder21
7h 35m ago completedCodexCoder21Organization/HandoffEmbeddedBuild never started because the runner was saturated: every build worker was already running a check. It waited 1s in the deferred queue before the existing local deferred-submission deadline expired.this service
7h 35m ago build pendingCodexCoder21Organization/HandoffEmbeddedRemote run 8fc1a1df remains PENDING after 225404s of queue wait; waiting for buildtest admission.this service
7h 35m ago build pendingCodexCoder21Organization/HandoffEmbeddedRemote run 97f5604a remains PENDING after 223006s of queue wait; waiting for buildtest admission.this service
7h 35m ago build remote stopCodexCoder21Organization/HandoffEmbeddedRemote stop attempt 3 for check run 123355709083 failed: foundation.url.protocol.sandbox.SandboxException: Sandboxed code threw an exception: java.lang.InternalError: Exception encountered in implementation of foundation/url/sjvm/intrinsics/ServiceBridge:rpc(Ljava/lang/String;Ljava/util/Map;)Ljava/util/Map; : foundation.url.resolver.UrlResolutionException: RPC request 'supersedeBuildRun' failed: INTERNAL_ERROR - RPC error: INTERNAL_ERROR - Cannot supersede build run 'de2f0a80': it is already in terminal status FAILED. Only in-progress builds can be superseded. cause: null. The cancellation stays saved; retrying in 240000ms.this service
7h 40m ago build pendingCodexCoder21Organization/HandoffEmbeddedRemote run 5ad6554b remains PENDING after 224418s of queue wait; waiting for buildtest admission.this service
7h 40m ago build pendingCodexCoder21Organization/HandoffEmbeddedRemote run 97f5604a remains PENDING after 222687s of queue wait; waiting for buildtest admission.this service
7h 41m ago build pendingCodexCoder21Organization/HandoffEmbeddedRemote run 8fc1a1df remains PENDING after 225061s of queue wait; waiting for buildtest admission.this service
7h 41m ago deliveryCodexCoder21Organization/HandoffEmbeddedGitHub delivered check_suite.completed for CodexCoder21Organization/HandoffEmbedded.codexcoder21
7h 41m ago deliveryCodexCoder21Organization/HandoffEmbeddedGitHub delivered check_run.completed for CodexCoder21Organization/HandoffEmbedded.codexcoder21
7h 41m ago completedCodexCoder21Organization/HandoffEmbeddedBuild never started because the runner was saturated: every build worker was already running a check. It waited 0s in the deferred queue before the existing local deferred-submission deadline expired.this service
7h 41m ago deliveryCodexCoder21Organization/HandoffEmbeddedGitHub delivered check_run.completed for CodexCoder21Organization/HandoffEmbedded.codexcoder21
7h 41m ago deliveryCodexCoder21Organization/HandoffEmbeddedGitHub delivered check_suite.completed for CodexCoder21Organization/HandoffEmbedded.codexcoder21
7h 42m ago deliveryCodexCoder21Organization/HandoffEmbeddedGitHub delivered check_run.completed for CodexCoder21Organization/HandoffEmbedded.codexcoder21
7h 42m ago completedCodexCoder21Organization/HandoffEmbeddedBuild never started because the runner was saturated: every build worker was already running a check. It waited 26s in the deferred queue before the existing local deferred-submission deadline expired.this service
7h 43m ago deliveryCodexCoder21Organization/HandoffEmbeddedGitHub delivered check_run.completed for CodexCoder21Organization/HandoffEmbedded.codexcoder21
7h 43m ago deliveryCodexCoder21Organization/HandoffEmbeddedGitHub delivered check_suite.completed for CodexCoder21Organization/HandoffEmbedded.codexcoder21
7h 43m ago completedCodexCoder21Organization/HandoffEmbeddedBuild never started because the runner was saturated: every build worker was already running a check. It waited 0s in the deferred queue before the existing local deferred-submission deadline expired.this service
7h 43m ago deliveryCodexCoder21Organization/HandoffEmbeddedGitHub delivered check_suite.completed for CodexCoder21Organization/HandoffEmbedded.codexcoder21
7h 43m ago deliveryCodexCoder21Organization/HandoffEmbeddedGitHub delivered check_run.completed for CodexCoder21Organization/HandoffEmbedded.codexcoder21
7h 44m ago completedCodexCoder21Organization/HandoffEmbeddedBuild never started because the runner was saturated: every build worker was already running a check. It waited 0s in the deferred queue before the existing local deferred-submission deadline expired.this service
7h 44m ago deliveryCodexCoder21Organization/HandoffEmbeddedGitHub delivered check_run.completed for CodexCoder21Organization/HandoffEmbedded.codexcoder21
7h 44m ago completedCodexCoder21Organization/HandoffEmbeddedBuild never started because the runner was saturated: every build worker was already running a check. It waited 1s in the deferred queue before the existing local deferred-submission deadline expired.this service
7h 44m ago build remote stopCodexCoder21Organization/HandoffEmbeddedRemote stop attempt 7 for check run 123302854390 failed: foundation.url.protocol.sandbox.SandboxException: Sandboxed code threw an exception: java.lang.InternalError: Exception encountered in implementation of foundation/url/sjvm/intrinsics/ServiceBridge:rpc(Ljava/lang/String;Ljava/util/Map;)Ljava/util/Map; : foundation.url.resolver.UrlResolutionException: RPC request 'supersedeBuildRun' failed: INTERNAL_ERROR - RPC error: INTERNAL_ERROR - Cannot supersede build run '8b269094': it is already in terminal status FAILED. Only in-progress builds can be superseded. cause: null. The cancellation stays saved; retrying in 1920000ms.this service
7h 45m ago deliveryCodexCoder21Organization/HandoffEmbeddedGitHub delivered check_run.completed for CodexCoder21Organization/HandoffEmbedded.codexcoder21
7h 45m ago completedCodexCoder21Organization/HandoffEmbeddedBuild never started because the runner was saturated: every build worker was already running a check. It waited 1s in the deferred queue before the existing local deferred-submission deadline expired.this service
7h 46m ago build pendingCodexCoder21Organization/HandoffEmbeddedRemote run 97f5604a remains PENDING after 222350s of queue wait; waiting for buildtest admission.this service
7h 46m ago build pendingCodexCoder21Organization/HandoffEmbeddedRemote run 5ad6554b remains PENDING after 224079s of queue wait; waiting for buildtest admission.this service
7h 46m ago build pendingCodexCoder21Organization/HandoffEmbeddedRemote run 8fc1a1df remains PENDING after 224740s of queue wait; waiting for buildtest admission.this service
7h 46m ago deliveryCodexCoder21Organization/HandoffEmbeddedGitHub delivered check_run.completed for CodexCoder21Organization/HandoffEmbedded.codexcoder21
7h 46m ago deliveryCodexCoder21Organization/HandoffEmbeddedGitHub delivered check_suite.completed for CodexCoder21Organization/HandoffEmbedded.codexcoder21
7h 46m ago completedCodexCoder21Organization/HandoffEmbeddedBuild never started because the runner was saturated: every build worker was already running a check. It waited 1s in the deferred queue before the existing local deferred-submission deadline expired.this service
7h 46m ago deliveryCodexCoder21Organization/HandoffEmbeddedGitHub delivered check_run.completed for CodexCoder21Organization/HandoffEmbedded.codexcoder21
7h 46m ago deliveryCodexCoder21Organization/HandoffEmbeddedGitHub delivered check_suite.completed for CodexCoder21Organization/HandoffEmbedded.codexcoder21
7h 46m ago completedCodexCoder21Organization/HandoffEmbeddedBuild never started because the runner was saturated: every build worker was already running a check. It waited 0s in the deferred queue before the existing local deferred-submission deadline expired.this service
7h 46m ago deliveryCodexCoder21Organization/HandoffEmbeddedGitHub delivered check_suite.completed for CodexCoder21Organization/HandoffEmbedded.codexcoder21
7h 46m ago deliveryCodexCoder21Organization/HandoffEmbeddedGitHub delivered check_run.completed for CodexCoder21Organization/HandoffEmbedded.codexcoder21
7h 46m ago completedCodexCoder21Organization/HandoffEmbeddedBuild never started because the runner was saturated: every build worker was already running a check. It waited 0s in the deferred queue before the existing local deferred-submission deadline expired.this service
7h 47m ago deliveryCodexCoder21Organization/HandoffEmbeddedGitHub delivered check_run.completed for CodexCoder21Organization/HandoffEmbedded.codexcoder21
7h 47m ago deliveryCodexCoder21Organization/HandoffEmbeddedGitHub delivered check_suite.completed for CodexCoder21Organization/HandoffEmbedded.codexcoder21
7h 47m ago completedCodexCoder21Organization/HandoffEmbeddedBuild never started because the runner was saturated: every build worker was already running a check. It waited 14s in the deferred queue before the existing local deferred-submission deadline expired.this service
7h 47m ago deliveryCodexCoder21Organization/HandoffEmbeddedGitHub delivered check_suite.completed for CodexCoder21Organization/HandoffEmbedded.codexcoder21
7h 47m ago deliveryCodexCoder21Organization/HandoffEmbeddedGitHub delivered check_run.completed for CodexCoder21Organization/HandoffEmbedded.codexcoder21
7h 47m ago completedCodexCoder21Organization/HandoffEmbeddedBuild failed: 291 passed, 1 failed, 292 totalthis service
7h 48m ago deliveryCodexCoder21Organization/HandoffEmbeddedGitHub delivered check_run.completed for CodexCoder21Organization/HandoffEmbedded.codexcoder21
7h 48m ago completedCodexCoder21Organization/HandoffEmbeddedBuild never started because the runner was saturated: every build worker was already running a check. It waited 5s in the deferred queue before the existing local deferred-submission deadline expired.this service
7h 48m ago deliveryCodexCoder21Organization/HandoffEmbeddedGitHub delivered check_run.completed for CodexCoder21Organization/HandoffEmbedded.codexcoder21
7h 48m ago completedCodexCoder21Organization/HandoffEmbeddedBuild never started because the runner was saturated: every build worker was already running a check. It waited 27s in the deferred queue before the existing local deferred-submission deadline expired.this service
7h 49m ago deliveryCodexCoder21Organization/HandoffEmbeddedGitHub delivered check_run.completed for CodexCoder21Organization/HandoffEmbedded.codexcoder21
7h 49m ago deliveryCodexCoder21Organization/HandoffEmbeddedGitHub delivered check_suite.completed for CodexCoder21Organization/HandoffEmbedded.codexcoder21
7h 49m ago completedCodexCoder21Organization/HandoffEmbeddedBuild never started because the runner was saturated: every build worker was already running a check. It waited 0s in the deferred queue before the existing local deferred-submission deadline expired.this service
7h 50m ago deliveryCodexCoder21Organization/HandoffEmbeddedGitHub delivered check_run.completed for CodexCoder21Organization/HandoffEmbedded.codexcoder21
7h 50m ago completedCodexCoder21Organization/HandoffEmbeddedBuild failed: 290 passed, 2 failed, 292 totalthis service
7h 51m ago deliveryCodexCoder21Organization/HandoffEmbeddedGitHub delivered check_run.completed for CodexCoder21Organization/HandoffEmbedded.codexcoder21
7h 51m ago deliveryCodexCoder21Organization/HandoffEmbeddedGitHub delivered check_suite.completed for CodexCoder21Organization/HandoffEmbedded.codexcoder21
7h 51m ago completedCodexCoder21Organization/HandoffEmbeddedBuild failed: 283 passed, 5 failed, 288 totalthis service
7h 52m ago build pendingCodexCoder21Organization/HandoffEmbeddedRemote run 8fc1a1df remains PENDING after 224395s of queue wait; waiting for buildtest admission.this service
7h 52m ago build pendingCodexCoder21Organization/HandoffEmbeddedRemote run 5ad6554b remains PENDING after 223732s of queue wait; waiting for buildtest admission.this service
7h 52m ago build pendingCodexCoder21Organization/HandoffEmbeddedRemote run 97f5604a remains PENDING after 222001s of queue wait; waiting for buildtest admission.this service
7h 56m ago deliveryCodexCoder21Organization/HandoffEmbeddedGitHub delivered check_run.completed for CodexCoder21Organization/HandoffEmbedded.codexcoder21
7h 56m ago completedCodexCoder21Organization/HandoffEmbeddedBuild never started because the runner was saturated: every build worker was already running a check. It waited 4s in the deferred queue before the existing local deferred-submission deadline expired.this service
7h 57m ago build pendingCodexCoder21Organization/HandoffEmbeddedRemote run 97f5604a remains PENDING after 221689s of queue wait; waiting for buildtest admission.this service
7h 57m ago build remote stopCodexCoder21Organization/HandoffEmbeddedRemote stop attempt 8 for check run 123240542600 failed: foundation.url.protocol.sandbox.SandboxException: Sandboxed code threw an exception: java.lang.InternalError: Exception encountered in implementation of foundation/url/sjvm/intrinsics/ServiceBridge:rpc(Ljava/lang/String;Ljava/util/Map;)Ljava/util/Map; : foundation.url.resolver.UrlResolutionException: RPC request 'supersedeBuildRun' failed: INTERNAL_ERROR - RPC error: INTERNAL_ERROR - Cannot supersede build run 'f264cca8': it is already in terminal status FAILED. Only in-progress builds can be superseded. cause: null. The cancellation stays saved; retrying in 1920000ms.this service
7h 58m ago deliveryCodexCoder21Organization/HandoffEmbeddedGitHub delivered check_run.completed for CodexCoder21Organization/HandoffEmbedded.codexcoder21
7h 59m ago completedCodexCoder21Organization/HandoffEmbeddedBuild never started because the runner was saturated: every build worker was already running a check. It waited 6s in the deferred queue before the existing local deferred-submission deadline expired.this service
7h 59m ago build remote stopCodexCoder21Organization/HandoffEmbeddedRemote stop attempt 10 for check run 123239424206 failed: foundation.url.protocol.sandbox.SandboxException: Sandboxed code threw an exception: java.lang.InternalError: Exception encountered in implementation of foundation/url/sjvm/intrinsics/ServiceBridge:rpc(Ljava/lang/String;Ljava/util/Map;)Ljava/util/Map; : foundation.url.resolver.UrlResolutionException: RPC request 'supersedeBuildRun' failed: INTERNAL_ERROR - RPC error: INTERNAL_ERROR - Cannot supersede build run '24e8c23d': it is already in terminal status FAILED. Only in-progress builds can be superseded. cause: null. The cancellation stays saved; retrying in 1920000ms.this service
7h 59m ago deliveryCodexCoder21Organization/HandoffEmbeddedGitHub delivered check_run.completed for CodexCoder21Organization/HandoffEmbedded.codexcoder21
7h 59m ago deliveryCodexCoder21Organization/HandoffEmbeddedGitHub delivered check_run.completed for CodexCoder21Organization/HandoffEmbedded.codexcoder21
7h 59m ago completedCodexCoder21Organization/HandoffEmbeddedBuild never started because the runner was saturated: every build worker was already running a check. It waited 5s in the deferred queue before the existing local deferred-submission deadline expired.this service
7h 59m ago deliveryCodexCoder21Organization/HandoffEmbeddedGitHub delivered check_run.completed for CodexCoder21Organization/HandoffEmbedded.codexcoder21
8h 0m ago completedCodexCoder21Organization/HandoffEmbeddedBuild never started because the runner was saturated: every build worker was already running a check. It waited 0s in the deferred queue before the existing local deferred-submission deadline expired.this service
8h 0m ago completedCodexCoder21Organization/HandoffEmbeddedBuild never started because the runner was saturated: every build worker was already running a check. It waited 2s in the deferred queue before the existing local deferred-submission deadline expired.this service
8h 0m ago build pendingCodexCoder21Organization/HandoffEmbeddedRemote run 5ad6554b remains PENDING after 223228s of queue wait; waiting for buildtest admission.this service
8h 0m ago build pendingCodexCoder21Organization/HandoffEmbeddedRemote run 8fc1a1df remains PENDING after 223889s of queue wait; waiting for buildtest admission.this service
8h 1m ago deliveryCodexCoder21Organization/HandoffEmbeddedGitHub delivered check_run.completed for CodexCoder21Organization/HandoffEmbedded.codexcoder21
8h 1m ago completedCodexCoder21Organization/HandoffEmbeddedBuild failed: 282 passed, 6 failed, 288 totalthis service
8h 2m ago build remote stopCodexCoder21Organization/HandoffEmbeddedRemote stop attempt 12 for check run 123237672004 failed: foundation.url.protocol.sandbox.SandboxException: Sandboxed code threw an exception: java.lang.InternalError: Exception encountered in implementation of foundation/url/sjvm/intrinsics/ServiceBridge:rpc(Ljava/lang/String;Ljava/util/Map;)Ljava/util/Map; : foundation.url.resolver.UrlResolutionException: RPC request 'supersedeBuildRun' failed: INTERNAL_ERROR - RPC error: INTERNAL_ERROR - Cannot supersede build run 'b9f6bf0f': it is already in terminal status FAILED. Only in-progress builds can be superseded. cause: null. The cancellation stays saved; retrying in 1920000ms.this service
8h 2m ago build remote stopCodexCoder21Organization/HandoffEmbeddedRemote stop attempt 13 for check run 123237637054 failed: foundation.url.protocol.sandbox.SandboxException: Sandboxed code threw an exception: java.lang.InternalError: Exception encountered in implementation of foundation/url/sjvm/intrinsics/ServiceBridge:rpc(Ljava/lang/String;Ljava/util/Map;)Ljava/util/Map; : foundation.url.resolver.UrlResolutionException: RPC request 'supersedeBuildRun' failed: INTERNAL_ERROR - RPC error: INTERNAL_ERROR - Cannot supersede build run 'b0df4ab1': it is already in terminal status FAILED. Only in-progress builds can be superseded. cause: null. The cancellation stays saved; retrying in 1920000ms.this service
8h 2m ago build remote stopCodexCoder21Organization/HandoffEmbeddedRemote stop attempt 11 for check run 123237670992 failed: foundation.url.protocol.sandbox.SandboxException: Sandboxed code threw an exception: java.lang.InternalError: Exception encountered in implementation of foundation/url/sjvm/intrinsics/ServiceBridge:rpc(Ljava/lang/String;Ljava/util/Map;)Ljava/util/Map; : foundation.url.resolver.UrlResolutionException: RPC request 'supersedeBuildRun' failed: INTERNAL_ERROR - RPC error: INTERNAL_ERROR - Cannot supersede build run '1824629e': it is already in terminal status FAILED. Only in-progress builds can be superseded. cause: null. The cancellation stays saved; retrying in 1920000ms.this service
8h 2m ago build remote stopCodexCoder21Organization/HandoffEmbeddedRemote stop attempt 12 for check run 123237637054 failed: foundation.url.protocol.sandbox.SandboxException: Sandboxed code threw an exception: java.lang.InternalError: Exception encountered in implementation of foundation/url/sjvm/intrinsics/ServiceBridge:rpc(Ljava/lang/String;Ljava/util/Map;)Ljava/util/Map; : foundation.url.resolver.UrlResolutionException: RPC request 'supersedeBuildRun' failed: INTERNAL_ERROR - RPC error: INTERNAL_ERROR - Cannot supersede build run 'b0df4ab1': it is already in terminal status FAILED. Only in-progress builds can be superseded. cause: null. The cancellation stays saved; retrying in 1920000ms.this service
8h 3m ago deliveryCodexCoder21Organization/HandoffEmbeddedGitHub delivered check_run.completed for CodexCoder21Organization/HandoffEmbedded.codexcoder21
8h 3m ago deliveryCodexCoder21Organization/HandoffEmbeddedGitHub delivered check_suite.completed for CodexCoder21Organization/HandoffEmbedded.codexcoder21