kotlin.build CI

Trigger log

Every delivery GitHub sent and what this service did with it — including the ones that produced no build. Newest first.

WhenWhatRepositoryDetailWho
23s ago build remote stopCodexCoder21Organization/PerformanceTestEmbeddedRemote stop attempt 42 for check run 123333496546 failed: foundation.url.protocol.sandbox.SandboxException: Sandboxed code threw an exception: java.lang.InternalError: Exception encountered in implementation of foundation/url/sjvm/intrinsics/ServiceBridge:rpc(Ljava/lang/String;Ljava/util/Map;)Ljava/util/Map; : foundation.url.resolver.UrlResolutionException: RPC request 'supersedeBuildRun' failed: INTERNAL_ERROR - RPC error: INTERNAL_ERROR - Cannot supersede build run '4f082cba': it is already in terminal status COMPLETED. Only in-progress builds can be superseded. cause: null. The cancellation stays saved; retrying in 1920000ms.this service
45m 48s ago build remote stopCodexCoder21Organization/PerformanceTestEmbeddedRemote stop attempt 41 for check run 123333496546 failed: foundation.url.protocol.sandbox.SandboxException: Sandboxed code threw an exception: java.lang.InternalError: Exception encountered in implementation of foundation/url/sjvm/intrinsics/ServiceBridge:rpc(Ljava/lang/String;Ljava/util/Map;)Ljava/util/Map; : foundation.url.resolver.UrlResolutionException: RPC request 'supersedeBuildRun' failed: INTERNAL_ERROR - RPC error: INTERNAL_ERROR - Cannot supersede build run '4f082cba': it is already in terminal status COMPLETED. Only in-progress builds can be superseded. cause: null. The cancellation stays saved; retrying in 1920000ms.this service
1h 53m ago build remote stopCodexCoder21Organization/PerformanceTestEmbeddedRemote stop attempt 40 for check run 123333496546 failed: foundation.url.protocol.sandbox.SandboxException: Sandboxed code threw an exception: java.lang.InternalError: Exception encountered in implementation of foundation/url/sjvm/intrinsics/ServiceBridge:rpc(Ljava/lang/String;Ljava/util/Map;)Ljava/util/Map; : foundation.url.resolver.UrlResolutionException: RPC request 'supersedeBuildRun' failed: INTERNAL_ERROR - RPC error: INTERNAL_ERROR - Cannot supersede build run '4f082cba': it is already in terminal status COMPLETED. Only in-progress builds can be superseded. cause: null. The cancellation stays saved; retrying in 1920000ms.this service
2h 39m ago build remote stopCodexCoder21Organization/PerformanceTestEmbeddedRemote stop attempt 39 for check run 123333496546 failed: foundation.url.protocol.sandbox.SandboxException: Sandboxed code threw an exception: java.lang.InternalError: Exception encountered in implementation of foundation/url/sjvm/intrinsics/ServiceBridge:rpc(Ljava/lang/String;Ljava/util/Map;)Ljava/util/Map; : foundation.url.resolver.UrlResolutionException: RPC request 'supersedeBuildRun' failed: INTERNAL_ERROR - RPC error: INTERNAL_ERROR - Cannot supersede build run '4f082cba': it is already in terminal status COMPLETED. Only in-progress builds can be superseded. cause: null. The cancellation stays saved; retrying in 1920000ms.this service
3h 58m ago build remote stopCodexCoder21Organization/PerformanceTestEmbeddedRemote stop attempt 38 for check run 123333496546 failed: foundation.url.protocol.sandbox.SandboxException: Sandboxed code threw an exception: java.lang.InternalError: Exception encountered in implementation of foundation/url/sjvm/intrinsics/ServiceBridge:rpc(Ljava/lang/String;Ljava/util/Map;)Ljava/util/Map; : foundation.url.resolver.UrlResolutionException: RPC request 'supersedeBuildRun' failed: INTERNAL_ERROR - RPC error: INTERNAL_ERROR - Cannot supersede build run '4f082cba': it is already in terminal status COMPLETED. Only in-progress builds can be superseded. cause: null. The cancellation stays saved; retrying in 1920000ms.this service
4h 38m ago build remote stopCodexCoder21Organization/PerformanceTestEmbeddedRemote stop attempt 37 for check run 123333496546 failed: foundation.url.protocol.sandbox.SandboxException: Sandboxed code threw an exception: java.lang.InternalError: Exception encountered in implementation of foundation/url/sjvm/intrinsics/ServiceBridge:rpc(Ljava/lang/String;Ljava/util/Map;)Ljava/util/Map; : foundation.url.resolver.UrlResolutionException: RPC request 'supersedeBuildRun' failed: INTERNAL_ERROR - RPC error: INTERNAL_ERROR - Cannot supersede build run '4f082cba': it is already in terminal status COMPLETED. Only in-progress builds can be superseded. cause: null. The cancellation stays saved; retrying in 1920000ms.this service
5h 33m ago build remote stopCodexCoder21Organization/PerformanceTestEmbeddedRemote stop attempt 36 for check run 123333496546 failed: foundation.url.protocol.sandbox.SandboxException: Sandboxed code threw an exception: java.lang.InternalError: Exception encountered in implementation of foundation/url/sjvm/intrinsics/ServiceBridge:rpc(Ljava/lang/String;Ljava/util/Map;)Ljava/util/Map; : foundation.url.resolver.UrlResolutionException: RPC request 'supersedeBuildRun' failed: INTERNAL_ERROR - RPC error: INTERNAL_ERROR - Cannot supersede build run '4f082cba': it is already in terminal status COMPLETED. Only in-progress builds can be superseded. cause: null. The cancellation stays saved; retrying in 1920000ms.this service
6h 21m ago build remote stopCodexCoder21Organization/PerformanceTestEmbeddedRemote stop attempt 35 for check run 123333496546 failed: foundation.url.protocol.sandbox.SandboxException: Sandboxed code threw an exception: java.lang.InternalError: Exception encountered in implementation of foundation/url/sjvm/intrinsics/ServiceBridge:rpc(Ljava/lang/String;Ljava/util/Map;)Ljava/util/Map; : foundation.url.resolver.UrlResolutionException: RPC request 'supersedeBuildRun' failed: INTERNAL_ERROR - RPC error: INTERNAL_ERROR - Cannot supersede build run '4f082cba': it is already in terminal status COMPLETED. Only in-progress builds can be superseded. cause: null. The cancellation stays saved; retrying in 1920000ms.this service
7h 14m ago build remote stopCodexCoder21Organization/PerformanceTestEmbeddedRemote stop attempt 34 for check run 123333496546 failed: foundation.url.protocol.sandbox.SandboxException: Sandboxed code threw an exception: java.lang.InternalError: Exception encountered in implementation of foundation/url/sjvm/intrinsics/ServiceBridge:rpc(Ljava/lang/String;Ljava/util/Map;)Ljava/util/Map; : foundation.url.resolver.UrlResolutionException: RPC request 'supersedeBuildRun' failed: INTERNAL_ERROR - RPC error: INTERNAL_ERROR - Cannot supersede build run '4f082cba': it is already in terminal status COMPLETED. Only in-progress builds can be superseded. cause: null. The cancellation stays saved; retrying in 1920000ms.this service
8h 5m ago build remote stopCodexCoder21Organization/PerformanceTestEmbeddedRemote stop attempt 33 for check run 123333496546 failed: foundation.url.protocol.sandbox.SandboxException: Sandboxed code threw an exception: java.lang.InternalError: Exception encountered in implementation of foundation/url/sjvm/intrinsics/ServiceBridge:rpc(Ljava/lang/String;Ljava/util/Map;)Ljava/util/Map; : foundation.url.resolver.UrlResolutionException: RPC request 'supersedeBuildRun' failed: INTERNAL_ERROR - RPC error: INTERNAL_ERROR - Cannot supersede build run '4f082cba': it is already in terminal status COMPLETED. Only in-progress builds can be superseded. cause: null. The cancellation stays saved; retrying in 1920000ms.this service
9h 3m ago build remote stopCodexCoder21Organization/PerformanceTestEmbeddedRemote stop attempt 32 for check run 123333496546 failed: foundation.url.protocol.sandbox.SandboxException: Sandboxed code threw an exception: java.lang.InternalError: Exception encountered in implementation of foundation/url/sjvm/intrinsics/ServiceBridge:rpc(Ljava/lang/String;Ljava/util/Map;)Ljava/util/Map; : foundation.url.resolver.UrlResolutionException: RPC request 'supersedeBuildRun' failed: INTERNAL_ERROR - RPC error: INTERNAL_ERROR - BuildTest service is not ready for 'supersedeBuildRun': startup recovery is in phase RECOVERING_LOCAL_STATE (elapsedMs=933670). No operation was performed. cause: null. The cancellation stays saved; retrying in 1920000ms.this service
10h 2m ago build remote stopCodexCoder21Organization/PerformanceTestEmbeddedRemote stop attempt 31 for check run 123333496546 failed: foundation.url.protocol.sandbox.SandboxException: Sandboxed code threw an exception: java.lang.InternalError: Exception encountered in implementation of foundation/url/sjvm/intrinsics/ServiceBridge:rpc(Ljava/lang/String;Ljava/util/Map;)Ljava/util/Map; : foundation.url.resolver.UrlResolutionException: RPC request 'supersedeBuildRun' failed: INTERNAL_ERROR - RPC error: INTERNAL_ERROR - Cannot supersede build run '4f082cba': it is already in terminal status COMPLETED. Only in-progress builds can be superseded. cause: null. The cancellation stays saved; retrying in 1920000ms.this service
11h 1m ago build remote stopCodexCoder21Organization/PerformanceTestEmbeddedRemote stop attempt 30 for check run 123333496546 failed: foundation.url.protocol.sandbox.SandboxException: Sandboxed code threw an exception: java.lang.InternalError: Exception encountered in implementation of foundation/url/sjvm/intrinsics/ServiceBridge:rpc(Ljava/lang/String;Ljava/util/Map;)Ljava/util/Map; : foundation.url.resolver.UrlResolutionException: RPC request 'supersedeBuildRun' failed: INTERNAL_ERROR - RPC error: INTERNAL_ERROR - Cannot supersede build run '4f082cba': it is already in terminal status COMPLETED. Only in-progress builds can be superseded. cause: null. The cancellation stays saved; retrying in 1920000ms.this service
11h 59m ago build remote stopCodexCoder21Organization/PerformanceTestEmbeddedRemote stop attempt 29 for check run 123333496546 failed: foundation.url.protocol.sandbox.SandboxException: Sandboxed code threw an exception: java.lang.InternalError: Exception encountered in implementation of foundation/url/sjvm/intrinsics/ServiceBridge:rpc(Ljava/lang/String;Ljava/util/Map;)Ljava/util/Map; : foundation.url.resolver.UrlResolutionException: RPC request 'supersedeBuildRun' failed: INTERNAL_ERROR - RPC error: INTERNAL_ERROR - Cannot supersede build run '4f082cba': it is already in terminal status COMPLETED. Only in-progress builds can be superseded. cause: null. The cancellation stays saved; retrying in 1920000ms.this service
12h 57m ago build remote stopCodexCoder21Organization/PerformanceTestEmbeddedRemote stop attempt 28 for check run 123333496546 failed: foundation.url.protocol.sandbox.SandboxException: Sandboxed code threw an exception: java.lang.InternalError: Exception encountered in implementation of foundation/url/sjvm/intrinsics/ServiceBridge:rpc(Ljava/lang/String;Ljava/util/Map;)Ljava/util/Map; : foundation.url.resolver.UrlResolutionException: RPC request 'supersedeBuildRun' failed: INTERNAL_ERROR - RPC error: INTERNAL_ERROR - Cannot supersede build run '4f082cba': it is already in terminal status COMPLETED. Only in-progress builds can be superseded. cause: null. The cancellation stays saved; retrying in 1920000ms.this service
13h 57m ago build remote stopCodexCoder21Organization/PerformanceTestEmbeddedRemote stop attempt 27 for check run 123333496546 failed: foundation.url.protocol.sandbox.SandboxException: Sandboxed code threw an exception: java.lang.InternalError: Exception encountered in implementation of foundation/url/sjvm/intrinsics/ServiceBridge:rpc(Ljava/lang/String;Ljava/util/Map;)Ljava/util/Map; : foundation.url.resolver.UrlResolutionException: RPC request 'supersedeBuildRun' failed: INTERNAL_ERROR - RPC error: INTERNAL_ERROR - Cannot supersede build run '4f082cba': it is already in terminal status COMPLETED. Only in-progress builds can be superseded. cause: null. The cancellation stays saved; retrying in 1920000ms.this service
14h 47m ago build remote stopCodexCoder21Organization/PerformanceTestEmbeddedRemote stop attempt 26 for check run 123333496546 failed: foundation.url.protocol.sandbox.SandboxException: Sandboxed code threw an exception: java.lang.InternalError: Exception encountered in implementation of foundation/url/sjvm/intrinsics/ServiceBridge:rpc(Ljava/lang/String;Ljava/util/Map;)Ljava/util/Map; : foundation.url.resolver.UrlResolutionException: RPC request 'supersedeBuildRun' failed: INTERNAL_ERROR - RPC error: INTERNAL_ERROR - Cannot supersede build run '4f082cba': it is already in terminal status COMPLETED. Only in-progress builds can be superseded. cause: null. The cancellation stays saved; retrying in 1920000ms.this service
15h 35m ago build remote stopCodexCoder21Organization/PerformanceTestEmbeddedRemote stop attempt 25 for check run 123333496546 failed: foundation.url.protocol.sandbox.SandboxException: Sandboxed code threw an exception: java.lang.InternalError: Exception encountered in implementation of foundation/url/sjvm/intrinsics/ServiceBridge:rpc(Ljava/lang/String;Ljava/util/Map;)Ljava/util/Map; : foundation.url.resolver.UrlResolutionException: RPC request 'supersedeBuildRun' failed: INTERNAL_ERROR - RPC error: INTERNAL_ERROR - Cannot supersede build run '4f082cba': it is already in terminal status COMPLETED. Only in-progress builds can be superseded. cause: null. The cancellation stays saved; retrying in 1920000ms.this service
16h 23m ago build remote stopCodexCoder21Organization/PerformanceTestEmbeddedRemote stop attempt 24 for check run 123333496546 failed: foundation.url.protocol.sandbox.SandboxException: Sandboxed code threw an exception: java.lang.InternalError: Exception encountered in implementation of foundation/url/sjvm/intrinsics/ServiceBridge:rpc(Ljava/lang/String;Ljava/util/Map;)Ljava/util/Map; : foundation.url.resolver.UrlResolutionException: RPC request 'supersedeBuildRun' failed: INTERNAL_ERROR - RPC error: INTERNAL_ERROR - Cannot supersede build run '4f082cba': it is already in terminal status COMPLETED. Only in-progress builds can be superseded. cause: null. The cancellation stays saved; retrying in 1920000ms.this service
17h 7m ago build remote stopCodexCoder21Organization/PerformanceTestEmbeddedRemote stop attempt 23 for check run 123333496546 failed: foundation.url.protocol.sandbox.SandboxException: Sandboxed code threw an exception: java.lang.InternalError: Exception encountered in implementation of foundation/url/sjvm/intrinsics/ServiceBridge:rpc(Ljava/lang/String;Ljava/util/Map;)Ljava/util/Map; : foundation.url.resolver.UrlResolutionException: RPC request 'supersedeBuildRun' failed: INTERNAL_ERROR - RPC error: INTERNAL_ERROR - Cannot supersede build run '4f082cba': it is already in terminal status COMPLETED. Only in-progress builds can be superseded. cause: null. The cancellation stays saved; retrying in 1920000ms.this service
17h 51m ago build remote stopCodexCoder21Organization/PerformanceTestEmbeddedRemote stop attempt 22 for check run 123333496546 failed: foundation.url.protocol.sandbox.SandboxException: Sandboxed code threw an exception: java.lang.InternalError: Exception encountered in implementation of foundation/url/sjvm/intrinsics/ServiceBridge:rpc(Ljava/lang/String;Ljava/util/Map;)Ljava/util/Map; : foundation.url.resolver.UrlResolutionException: RPC request 'supersedeBuildRun' failed: INTERNAL_ERROR - RPC error: INTERNAL_ERROR - Cannot supersede build run '4f082cba': it is already in terminal status COMPLETED. Only in-progress builds can be superseded. cause: null. The cancellation stays saved; retrying in 1920000ms.this service
18h 54m ago build remote stopCodexCoder21Organization/PerformanceTestEmbeddedRemote stop attempt 21 for check run 123333496546 failed: foundation.url.protocol.sandbox.SandboxException: Sandboxed code threw an exception: java.lang.InternalError: Exception encountered in implementation of foundation/url/sjvm/intrinsics/ServiceBridge:rpc(Ljava/lang/String;Ljava/util/Map;)Ljava/util/Map; : foundation.url.resolver.UrlResolutionException: RPC request 'supersedeBuildRun' failed: INTERNAL_ERROR - RPC error: INTERNAL_ERROR - Cannot supersede build run '4f082cba': it is already in terminal status COMPLETED. Only in-progress builds can be superseded. cause: null. The cancellation stays saved; retrying in 1920000ms.this service
19h 39m ago build remote stopCodexCoder21Organization/PerformanceTestEmbeddedRemote stop attempt 20 for check run 123333496546 failed: foundation.url.protocol.sandbox.SandboxException: Sandboxed code threw an exception: java.lang.InternalError: Exception encountered in implementation of foundation/url/sjvm/intrinsics/ServiceBridge:rpc(Ljava/lang/String;Ljava/util/Map;)Ljava/util/Map; : foundation.url.resolver.UrlResolutionException: RPC request 'supersedeBuildRun' failed: INTERNAL_ERROR - RPC error: INTERNAL_ERROR - Cannot supersede build run '4f082cba': it is already in terminal status COMPLETED. Only in-progress builds can be superseded. cause: null. The cancellation stays saved; retrying in 1920000ms.this service
20h 24m ago build remote stopCodexCoder21Organization/PerformanceTestEmbeddedRemote stop attempt 19 for check run 123333496546 failed: foundation.url.protocol.sandbox.SandboxException: Sandboxed code threw an exception: java.lang.InternalError: Exception encountered in implementation of foundation/url/sjvm/intrinsics/ServiceBridge:rpc(Ljava/lang/String;Ljava/util/Map;)Ljava/util/Map; : foundation.url.resolver.UrlResolutionException: RPC request 'supersedeBuildRun' failed: INTERNAL_ERROR - RPC error: INTERNAL_ERROR - Cannot supersede build run '4f082cba': it is already in terminal status COMPLETED. Only in-progress builds can be superseded. cause: null. The cancellation stays saved; retrying in 1920000ms.this service
21h 11m ago build remote stopCodexCoder21Organization/PerformanceTestEmbeddedRemote stop attempt 18 for check run 123333496546 failed: foundation.url.protocol.sandbox.SandboxException: Sandboxed code threw an exception: java.lang.InternalError: Exception encountered in implementation of foundation/url/sjvm/intrinsics/ServiceBridge:rpc(Ljava/lang/String;Ljava/util/Map;)Ljava/util/Map; : foundation.url.resolver.UrlResolutionException: RPC request 'supersedeBuildRun' failed: INTERNAL_ERROR - RPC error: INTERNAL_ERROR - Cannot supersede build run '4f082cba': it is already in terminal status COMPLETED. Only in-progress builds can be superseded. cause: null. The cancellation stays saved; retrying in 1920000ms.this service
22h 1m ago build remote stopCodexCoder21Organization/PerformanceTestEmbeddedRemote stop attempt 17 for check run 123333496546 failed: foundation.url.protocol.sandbox.SandboxException: Sandboxed code threw an exception: java.lang.InternalError: Exception encountered in implementation of foundation/url/sjvm/intrinsics/ServiceBridge:rpc(Ljava/lang/String;Ljava/util/Map;)Ljava/util/Map; : foundation.url.resolver.UrlResolutionException: RPC request 'supersedeBuildRun' failed: INTERNAL_ERROR - RPC error: INTERNAL_ERROR - Cannot supersede build run '4f082cba': it is already in terminal status COMPLETED. Only in-progress builds can be superseded. cause: null. The cancellation stays saved; retrying in 1920000ms.this service
22h 47m ago build remote stopCodexCoder21Organization/PerformanceTestEmbeddedRemote stop attempt 16 for check run 123333496546 failed: foundation.url.protocol.sandbox.SandboxException: Sandboxed code threw an exception: java.lang.InternalError: Exception encountered in implementation of foundation/url/sjvm/intrinsics/ServiceBridge:rpc(Ljava/lang/String;Ljava/util/Map;)Ljava/util/Map; : foundation.url.resolver.UrlResolutionException: RPC request 'supersedeBuildRun' failed: INTERNAL_ERROR - RPC error: INTERNAL_ERROR - Cannot supersede build run '4f082cba': it is already in terminal status COMPLETED. Only in-progress builds can be superseded. cause: null. The cancellation stays saved; retrying in 1920000ms.this service
1d 0h ago build remote stopCodexCoder21Organization/PerformanceTestEmbeddedRemote stop attempt 15 for check run 123333496546 failed: foundation.url.protocol.sandbox.SandboxException: Sandboxed code threw an exception: java.lang.InternalError: Exception encountered in implementation of foundation/url/sjvm/intrinsics/ServiceBridge:rpc(Ljava/lang/String;Ljava/util/Map;)Ljava/util/Map; : foundation.url.resolver.UrlResolutionException: RPC request 'supersedeBuildRun' failed: INTERNAL_ERROR - RPC error: INTERNAL_ERROR - Cannot supersede build run '4f082cba': it is already in terminal status COMPLETED. Only in-progress builds can be superseded. cause: null. The cancellation stays saved; retrying in 1920000ms.this service
1d 0h ago build remote stopCodexCoder21Organization/PerformanceTestEmbeddedRemote stop attempt 14 for check run 123333496546 failed: foundation.url.protocol.sandbox.SandboxException: Sandboxed code threw an exception: java.lang.InternalError: Exception encountered in implementation of foundation/url/sjvm/intrinsics/ServiceBridge:rpc(Ljava/lang/String;Ljava/util/Map;)Ljava/util/Map; : foundation.url.resolver.UrlResolutionException: RPC request 'supersedeBuildRun' failed: INTERNAL_ERROR - RPC error: INTERNAL_ERROR - Cannot supersede build run '4f082cba': it is already in terminal status COMPLETED. Only in-progress builds can be superseded. cause: null. The cancellation stays saved; retrying in 1920000ms.this service
1d 1h ago build remote stopCodexCoder21Organization/PerformanceTestEmbeddedRemote stop attempt 13 for check run 123333496546 failed: foundation.url.protocol.sandbox.SandboxException: Sandboxed code threw an exception: java.lang.InternalError: Exception encountered in implementation of foundation/url/sjvm/intrinsics/ServiceBridge:rpc(Ljava/lang/String;Ljava/util/Map;)Ljava/util/Map; : foundation.url.resolver.UrlResolutionException: RPC request 'supersedeBuildRun' failed: INTERNAL_ERROR - RPC error: INTERNAL_ERROR - Cannot supersede build run '4f082cba': it is already in terminal status COMPLETED. Only in-progress builds can be superseded. cause: null. The cancellation stays saved; retrying in 1920000ms.this service
1d 2h ago build remote stopCodexCoder21Organization/PerformanceTestEmbeddedRemote stop attempt 12 for check run 123333496546 failed: foundation.url.protocol.sandbox.SandboxException: Sandboxed code threw an exception: java.lang.InternalError: Exception encountered in implementation of foundation/url/sjvm/intrinsics/ServiceBridge:rpc(Ljava/lang/String;Ljava/util/Map;)Ljava/util/Map; : foundation.url.resolver.UrlResolutionException: RPC request 'supersedeBuildRun' failed: RELAY_ERROR - Handler error: RPC error: INTERNAL_ERROR - Cannot supersede build run '4f082cba': it is already in terminal status COMPLETED. Only in-progress builds can be superseded. cause: null. The cancellation stays saved; retrying in 1920000ms.this service
1d 3h ago build remote stopCodexCoder21Organization/PerformanceTestEmbeddedRemote stop attempt 11 for check run 123333496546 failed: foundation.url.protocol.sandbox.SandboxException: Sandboxed code threw an exception: java.lang.InternalError: Exception encountered in implementation of foundation/url/sjvm/intrinsics/ServiceBridge:rpc(Ljava/lang/String;Ljava/util/Map;)Ljava/util/Map; : foundation.url.resolver.UrlResolutionException: RPC request 'supersedeBuildRun' failed: RELAY_ERROR - Handler error: RPC error: INTERNAL_ERROR - Cannot supersede build run '4f082cba': it is already in terminal status COMPLETED. Only in-progress builds can be superseded. cause: null. The cancellation stays saved; retrying in 1920000ms.this service
1d 4h ago build remote stopCodexCoder21Organization/PerformanceTestEmbeddedRemote stop attempt 10 for check run 123333496546 failed: foundation.url.protocol.sandbox.SandboxException: Sandboxed code threw an exception: java.lang.InternalError: Exception encountered in implementation of foundation/url/sjvm/intrinsics/ServiceBridge:rpc(Ljava/lang/String;Ljava/util/Map;)Ljava/util/Map; : foundation.url.resolver.UrlResolutionException: RPC request 'supersedeBuildRun' failed: RELAY_ERROR - Handler error: RPC error: INTERNAL_ERROR - Cannot supersede build run '4f082cba': it is already in terminal status COMPLETED. Only in-progress builds can be superseded. cause: null. The cancellation stays saved; retrying in 1920000ms.this service
1d 4h ago build remote stopCodexCoder21Organization/PerformanceTestEmbeddedRemote stop attempt 9 for check run 123333496546 failed: foundation.url.protocol.sandbox.SandboxException: Sandboxed code threw an exception: java.lang.InternalError: Exception encountered in implementation of foundation/url/sjvm/intrinsics/ServiceBridge:rpc(Ljava/lang/String;Ljava/util/Map;)Ljava/util/Map; : foundation.url.resolver.UrlResolutionException: RPC request 'supersedeBuildRun' failed: RELAY_ERROR - Handler error: RPC error: INTERNAL_ERROR - Cannot supersede build run '4f082cba': it is already in terminal status COMPLETED. Only in-progress builds can be superseded. cause: null. The cancellation stays saved; retrying in 1920000ms.this service
1d 5h ago build remote stopCodexCoder21Organization/PerformanceTestEmbeddedRemote stop attempt 8 for check run 123333496546 failed: foundation.url.protocol.sandbox.SandboxException: Sandboxed code threw an exception: java.lang.InternalError: Exception encountered in implementation of foundation/url/sjvm/intrinsics/ServiceBridge:rpc(Ljava/lang/String;Ljava/util/Map;)Ljava/util/Map; : foundation.url.resolver.UrlResolutionException: RPC request 'supersedeBuildRun' failed: RELAY_ERROR - Handler error: RPC error: INTERNAL_ERROR - Cannot supersede build run '4f082cba': it is already in terminal status COMPLETED. Only in-progress builds can be superseded. cause: null. The cancellation stays saved; retrying in 1920000ms.this service
1d 6h ago build remote stopCodexCoder21Organization/PerformanceTestEmbeddedRemote stop attempt 7 for check run 123333496546 failed: foundation.url.protocol.sandbox.SandboxException: Sandboxed code threw an exception: java.lang.InternalError: Exception encountered in implementation of foundation/url/sjvm/intrinsics/ServiceBridge:rpc(Ljava/lang/String;Ljava/util/Map;)Ljava/util/Map; : foundation.url.resolver.UrlResolutionException: RPC request 'supersedeBuildRun' failed: RELAY_ERROR - Handler error: RPC error: INTERNAL_ERROR - Cannot supersede build run '4f082cba': it is already in terminal status COMPLETED. Only in-progress builds can be superseded. cause: null. The cancellation stays saved; retrying in 1920000ms.this service
1d 7h ago build remote stopCodexCoder21Organization/PerformanceTestEmbeddedRemote stop attempt 6 for check run 123333496546 failed: foundation.url.protocol.sandbox.SandboxException: Sandboxed code threw an exception: java.lang.InternalError: Exception encountered in implementation of foundation/url/sjvm/intrinsics/ServiceBridge:rpc(Ljava/lang/String;Ljava/util/Map;)Ljava/util/Map; : foundation.url.resolver.UrlResolutionException: RPC request 'supersedeBuildRun' failed: INTERNAL_ERROR - RPC error: INTERNAL_ERROR - Cannot supersede build run '4f082cba': it is already in terminal status COMPLETED. Only in-progress builds can be superseded. cause: null. The cancellation stays saved; retrying in 1920000ms.this service
1d 8h ago build remote stopCodexCoder21Organization/PerformanceTestEmbeddedRemote stop attempt 5 for check run 123333496546 failed: foundation.url.protocol.sandbox.SandboxException: Sandboxed code threw an exception: java.lang.InternalError: Exception encountered in implementation of foundation/url/sjvm/intrinsics/ServiceBridge:rpc(Ljava/lang/String;Ljava/util/Map;)Ljava/util/Map; : foundation.url.resolver.UrlResolutionException: RPC request 'supersedeBuildRun' failed: INTERNAL_ERROR - RPC error: INTERNAL_ERROR - Cannot supersede build run '4f082cba': it is already in terminal status COMPLETED. Only in-progress builds can be superseded. cause: null. The cancellation stays saved; retrying in 960000ms.this service
1d 9h ago deliveryCodexCoder21Organization/PerformanceTestEmbeddedGitHub delivered check_run.completed for CodexCoder21Organization/PerformanceTestEmbedded.codexcoder21
1d 9h ago deliveryCodexCoder21Organization/PerformanceTestEmbeddedGitHub delivered check_suite.completed for CodexCoder21Organization/PerformanceTestEmbedded.codexcoder21
1d 9h ago completedCodexCoder21Organization/PerformanceTestEmbeddedAll tests passing (52/52)this service
1d 9h ago build remote stopCodexCoder21Organization/PerformanceTestEmbeddedRemote stop attempt 4 for check run 123333496546 failed: foundation.url.protocol.sandbox.SandboxException: Sandboxed code threw an exception: java.lang.InternalError: Exception encountered in implementation of foundation/url/sjvm/intrinsics/ServiceBridge:rpc(Ljava/lang/String;Ljava/util/Map;)Ljava/util/Map; : foundation.url.resolver.UrlResolutionException: RPC request 'supersedeBuildRun' failed: INTERNAL_ERROR - RPC error: INTERNAL_ERROR - Cannot supersede build run '4f082cba': it is already in terminal status COMPLETED. Only in-progress builds can be superseded. cause: null. The cancellation stays saved; retrying in 480000ms.this service
1d 9h ago build pendingCodexCoder21Organization/PerformanceTestEmbeddedRemote run ba7e1c01 remains PENDING after 4393s of queue wait; waiting for buildtest admission.this service
1d 9h ago build pendingCodexCoder21Organization/PerformanceTestEmbeddedRemote run ba7e1c01 remains PENDING after 4063s of queue wait; waiting for buildtest admission.this service
1d 10h ago build pendingCodexCoder21Organization/PerformanceTestEmbeddedRemote run ba7e1c01 remains PENDING after 3720s of queue wait; waiting for buildtest admission.this service
1d 10h ago build pendingCodexCoder21Organization/PerformanceTestEmbeddedRemote run ba7e1c01 remains PENDING after 3395s of queue wait; waiting for buildtest admission.this service
1d 10h ago build pendingCodexCoder21Organization/PerformanceTestEmbeddedRemote run ba7e1c01 remains PENDING after 3046s of queue wait; waiting for buildtest admission.this service
1d 10h ago build pendingCodexCoder21Organization/PerformanceTestEmbeddedRemote run ba7e1c01 remains PENDING after 2746s of queue wait; waiting for buildtest admission.this service
1d 10h ago build pendingCodexCoder21Organization/PerformanceTestEmbeddedRemote run ba7e1c01 remains PENDING after 2398s of queue wait; waiting for buildtest admission.this service
1d 10h ago build remote stopCodexCoder21Organization/PerformanceTestEmbeddedRemote stop attempt 3 for check run 123333496546 failed: foundation.url.protocol.sandbox.SandboxException: Sandboxed code threw an exception: java.lang.InternalError: Exception encountered in implementation of foundation/url/sjvm/intrinsics/ServiceBridge:rpc(Ljava/lang/String;Ljava/util/Map;)Ljava/util/Map; : foundation.url.resolver.UrlResolutionException: RPC request 'supersedeBuildRun' failed: INTERNAL_ERROR - RPC error: INTERNAL_ERROR - Cannot supersede build run '4f082cba': it is already in terminal status COMPLETED. Only in-progress builds can be superseded. cause: null. The cancellation stays saved; retrying in 240000ms.this service
1d 10h ago build pendingCodexCoder21Organization/PerformanceTestEmbeddedRemote run ba7e1c01 remains PENDING after 1882s of queue wait; waiting for buildtest admission.this service
1d 10h ago build pendingCodexCoder21Organization/PerformanceTestEmbeddedRemote run ba7e1c01 remains PENDING after 1474s of queue wait; waiting for buildtest admission.this service
1d 10h ago deliveryCodexCoder21Organization/PerformanceTestEmbeddedGitHub delivered check_run.completed for CodexCoder21Organization/PerformanceTestEmbedded.codexcoder21
1d 10h ago completedCodexCoder21Organization/PerformanceTestEmbeddedBuild infrastructure error: java.lang.RuntimeException: Upload of build 276b77e7 failed after 5 attempts. Upload attribution for 'CodexCoder21Organization/PerformanceTestEmbedded': stalled step=uploadChunk, chunk 0 of 1, upload session=276b77e7, upload sessions created=1, createUploadSession attempts=1, upload attempts=5, last completed step=createUploadSession at 1793277229704 (2026-10-29T12:33:49.704Z), last error=foundation.url.protocol.sandbox.SandboxException: Sandboxed code threw an exception: java.lang.InternalError: Exception encountered in implementation of foundation/url/sjvm/intrinsics/ServiceBridge:rpc(Ljava/lang/String;Ljava/util/Map;)Ljava/util/Map; :this service
1d 10h ago build pendingCodexCoder21Organization/PerformanceTestEmbeddedRemote run ba7e1c01 remains PENDING after 1124s of queue wait; waiting for buildtest admission.this service
1d 10h ago deliveryCodexCoder21Organization/PerformanceTestEmbeddedGitHub delivered check_run.completed for CodexCoder21Organization/PerformanceTestEmbedded.codexcoder21
1d 10h ago completedCodexCoder21Organization/PerformanceTestEmbeddedBuild never started because the runner was saturated: every build worker was already running a check. It waited 25s in the deferred queue before the existing local deferred-submission deadline expired.this service
1d 10h ago build pendingCodexCoder21Organization/PerformanceTestEmbeddedRemote run ba7e1c01 remains PENDING after 665s of queue wait; waiting for buildtest admission.this service
1d 10h ago build pendingCodexCoder21Organization/PerformanceTestEmbeddedRemote run ba7e1c01 remains PENDING after 358s of queue wait; waiting for buildtest admission.this service
1d 10h ago deliveryCodexCoder21Organization/PerformanceTestEmbeddedGitHub delivered check_run.completed for CodexCoder21Organization/PerformanceTestEmbedded.codexcoder21
1d 10h ago deliveryCodexCoder21Organization/PerformanceTestEmbeddedGitHub delivered check_run.completed for CodexCoder21Organization/PerformanceTestEmbedded.codexcoder21
1d 10h ago completedCodexCoder21Organization/PerformanceTestEmbeddedBuild never started because the runner was saturated: every build worker was already running a check. It waited 2s in the deferred queue before the existing local deferred-submission deadline expired.this service
1d 10h ago completedCodexCoder21Organization/PerformanceTestEmbeddedBuild never started because the runner was saturated: every build worker was already running a check. It waited 1s in the deferred queue before the existing local deferred-submission deadline expired.this service
1d 10h ago deliveryCodexCoder21Organization/PerformanceTestEmbeddedGitHub delivered check_run.completed for CodexCoder21Organization/PerformanceTestEmbedded.codexcoder21
1d 11h ago build remote stopCodexCoder21Organization/PerformanceTestEmbeddedRemote stop attempt 2 for check run 123333496546 failed: foundation.url.protocol.sandbox.SandboxException: Sandboxed code threw an exception: java.lang.InternalError: Exception encountered in implementation of foundation/url/sjvm/intrinsics/ServiceBridge:rpc(Ljava/lang/String;Ljava/util/Map;)Ljava/util/Map; : foundation.url.resolver.UrlResolutionException: RPC request 'supersedeBuildRun' failed: INTERNAL_ERROR - RPC error: INTERNAL_ERROR - Cannot supersede build run '4f082cba': it is already in terminal status COMPLETED. Only in-progress builds can be superseded. cause: null. The cancellation stays saved; retrying in 120000ms.this service
1d 11h ago build pendingCodexCoder21Organization/PerformanceTestEmbeddedRemote run ba7e1c01 remains PENDING after 37s of queue wait; waiting for buildtest admission.this service
1d 11h ago rerequest completedCodexCoder21Organization/PerformanceTestEmbeddedGitHub rerequest delivery '775e1b50-d370-11f1-8315-4dbd7e89a64c' completed with known result ACTION_TAKEN.this service
1d 11h ago deliveryCodexCoder21Organization/PerformanceTestEmbeddedGitHub delivered check_run.created for CodexCoder21Organization/PerformanceTestEmbedded.codexcoder21
1d 11h ago deliveryCodexCoder21Organization/PerformanceTestEmbeddedGitHub delivered check_run.created for CodexCoder21Organization/PerformanceTestEmbedded.codexcoder21
1d 11h ago dispatchedCodexCoder21Organization/PerformanceTestEmbeddedSubmitted to the direct-buildtest build service.this service
1d 11h ago deliveryCodexCoder21Organization/PerformanceTestEmbeddedGitHub delivered check_run.completed for CodexCoder21Organization/PerformanceTestEmbedded.codexcoder21
1d 11h ago deliveryCodexCoder21Organization/PerformanceTestEmbeddedGitHub delivered check_suite.completed for CodexCoder21Organization/PerformanceTestEmbedded.codexcoder21
1d 11h ago completedCodexCoder21Organization/PerformanceTestEmbeddedThis check was rerequested; stopping the previous in-flight run was requested and continues in the background.this service