kotlin.build CI

Trigger log

Every delivery GitHub sent and what this service did with it — including the ones that produced no build. Newest first.

WhenWhatRepositoryDetailWho
10m 55s ago build remote stopCodexCoder21Organization/PerformanceTestServerServiceRemote stop attempt 11 for check run 123353019185 failed: foundation.url.protocol.sandbox.SandboxException: Sandboxed code threw an exception: java.lang.InternalError: Exception encountered in implementation of foundation/url/sjvm/intrinsics/ServiceBridge:rpc(Ljava/lang/String;Ljava/util/Map;)Ljava/util/Map; : foundation.url.resolver.UrlResolutionException: RPC request 'supersedeBuildRun' failed: RELAY_ERROR - Handler error: RPC error: INTERNAL_ERROR - Cannot supersede build run 'a4395125': it is already in terminal status FAILED. Only in-progress builds can be superseded. cause: null. The cancellation stays saved; retrying in 1920000ms.this service
13m 41s ago build remote stopCodexCoder21Organization/PerformanceTestServerServiceRemote stop attempt 9 for check run 123414784896 failed: foundation.url.protocol.sandbox.SandboxException: Sandboxed code threw an exception: java.lang.InternalError: Exception encountered in implementation of foundation/url/sjvm/intrinsics/ServiceBridge:rpc(Ljava/lang/String;Ljava/util/Map;)Ljava/util/Map; : foundation.url.resolver.UrlResolutionException: RPC request 'supersedeBuildRun' failed: RELAY_ERROR - Handler error: RPC error: INTERNAL_ERROR - Cannot supersede build run '36ae7182': it is already in terminal status FAILED. Only in-progress builds can be superseded. cause: null. The cancellation stays saved; retrying in 1920000ms.this service
23m 56s ago build remote stopCodexCoder21Organization/PerformanceTestServerServiceRemote stop attempt 12 for check run 123333491531 failed: foundation.url.protocol.sandbox.SandboxException: Sandboxed code threw an exception: java.lang.InternalError: Exception encountered in implementation of foundation/url/sjvm/intrinsics/ServiceBridge:rpc(Ljava/lang/String;Ljava/util/Map;)Ljava/util/Map; : foundation.url.resolver.UrlResolutionException: RPC request 'supersedeBuildRun' failed: RELAY_ERROR - Handler error: RPC error: INTERNAL_ERROR - Cannot supersede build run '14a9a396': it is already in terminal status COMPLETED. Only in-progress builds can be superseded. cause: null. The cancellation stays saved; retrying in 1920000ms.this service
28m 53s ago build remote stopCodexCoder21Organization/PerformanceTestServerServiceRemote stop attempt 11 for check run 123313394575 failed: foundation.url.protocol.sandbox.SandboxException: Sandboxed code threw an exception: java.lang.InternalError: Exception encountered in implementation of foundation/url/sjvm/intrinsics/ServiceBridge:rpc(Ljava/lang/String;Ljava/util/Map;)Ljava/util/Map; : foundation.url.resolver.UrlResolutionException: RPC request 'supersedeBuildRun' failed: RELAY_ERROR - Handler error: RPC error: INTERNAL_ERROR - Cannot supersede build run '9fec490a': it is already in terminal status COMPLETED. Only in-progress builds can be superseded. cause: null. The cancellation stays saved; retrying in 1920000ms.this service
57m 59s ago build remote stopCodexCoder21Organization/PerformanceTestServerServiceRemote stop attempt 10 for check run 123353019185 failed: foundation.url.protocol.sandbox.SandboxException: Sandboxed code threw an exception: java.lang.InternalError: Exception encountered in implementation of foundation/url/sjvm/intrinsics/ServiceBridge:rpc(Ljava/lang/String;Ljava/util/Map;)Ljava/util/Map; : foundation.url.resolver.UrlResolutionException: RPC request 'supersedeBuildRun' failed: RELAY_ERROR - Handler error: RPC error: INTERNAL_ERROR - Cannot supersede build run 'a4395125': it is already in terminal status FAILED. Only in-progress builds can be superseded. cause: null. The cancellation stays saved; retrying in 1920000ms.this service
1h 6m ago build remote stopCodexCoder21Organization/PerformanceTestServerServiceRemote stop attempt 8 for check run 123414784896 failed: foundation.url.protocol.sandbox.SandboxException: Sandboxed code threw an exception: java.lang.InternalError: Exception encountered in implementation of foundation/url/sjvm/intrinsics/ServiceBridge:rpc(Ljava/lang/String;Ljava/util/Map;)Ljava/util/Map; : foundation.url.resolver.UrlResolutionException: RPC request 'supersedeBuildRun' failed: RELAY_ERROR - Handler error: RPC error: INTERNAL_ERROR - Cannot supersede build run '36ae7182': it is already in terminal status FAILED. Only in-progress builds can be superseded. cause: null. The cancellation stays saved; retrying in 1920000ms.this service
1h 10m ago build remote stopCodexCoder21Organization/PerformanceTestServerServiceRemote stop attempt 11 for check run 123333491531 failed: foundation.url.protocol.sandbox.SandboxException: Sandboxed code threw an exception: java.lang.InternalError: Exception encountered in implementation of foundation/url/sjvm/intrinsics/ServiceBridge:rpc(Ljava/lang/String;Ljava/util/Map;)Ljava/util/Map; : foundation.url.resolver.UrlResolutionException: RPC request 'supersedeBuildRun' failed: RELAY_ERROR - Handler error: RPC error: INTERNAL_ERROR - Cannot supersede build run '14a9a396': it is already in terminal status COMPLETED. Only in-progress builds can be superseded. cause: null. The cancellation stays saved; retrying in 1920000ms.this service
1h 15m ago build remote stopCodexCoder21Organization/PerformanceTestServerServiceRemote stop attempt 10 for check run 123313394575 failed: foundation.url.protocol.sandbox.SandboxException: Sandboxed code threw an exception: java.lang.InternalError: Exception encountered in implementation of foundation/url/sjvm/intrinsics/ServiceBridge:rpc(Ljava/lang/String;Ljava/util/Map;)Ljava/util/Map; : foundation.url.resolver.UrlResolutionException: RPC request 'supersedeBuildRun' failed: RELAY_ERROR - Handler error: RPC error: INTERNAL_ERROR - Cannot supersede build run '9fec490a': it is already in terminal status COMPLETED. Only in-progress builds can be superseded. cause: null. The cancellation stays saved; retrying in 1920000ms.this service
1h 46m ago build remote stopCodexCoder21Organization/PerformanceTestServerServiceRemote stop attempt 9 for check run 123353019185 failed: foundation.url.protocol.sandbox.SandboxException: Sandboxed code threw an exception: java.lang.InternalError: Exception encountered in implementation of foundation/url/sjvm/intrinsics/ServiceBridge:rpc(Ljava/lang/String;Ljava/util/Map;)Ljava/util/Map; : foundation.url.resolver.UrlResolutionException: RPC request 'supersedeBuildRun' failed: RELAY_ERROR - Handler error: RPC error: INTERNAL_ERROR - Cannot supersede build run 'a4395125': it is already in terminal status FAILED. Only in-progress builds can be superseded. cause: null. The cancellation stays saved; retrying in 1920000ms.this service
1h 57m ago build remote stopCodexCoder21Organization/PerformanceTestServerServiceRemote stop attempt 10 for check run 123333491531 failed: foundation.url.protocol.sandbox.SandboxException: Sandboxed code threw an exception: java.lang.InternalError: Exception encountered in implementation of foundation/url/sjvm/intrinsics/ServiceBridge:rpc(Ljava/lang/String;Ljava/util/Map;)Ljava/util/Map; : foundation.url.resolver.UrlResolutionException: RPC request 'supersedeBuildRun' failed: RELAY_ERROR - Handler error: RPC error: INTERNAL_ERROR - Cannot supersede build run '14a9a396': it is already in terminal status COMPLETED. Only in-progress builds can be superseded. cause: null. The cancellation stays saved; retrying in 1920000ms.this service
1h 58m ago build remote stopCodexCoder21Organization/PerformanceTestServerServiceRemote stop attempt 7 for check run 123414784896 failed: foundation.url.protocol.sandbox.SandboxException: Sandboxed code threw an exception: java.lang.InternalError: Exception encountered in implementation of foundation/url/sjvm/intrinsics/ServiceBridge:rpc(Ljava/lang/String;Ljava/util/Map;)Ljava/util/Map; : foundation.url.resolver.UrlResolutionException: RPC request 'supersedeBuildRun' failed: RELAY_ERROR - Handler error: RPC error: INTERNAL_ERROR - Cannot supersede build run '36ae7182': it is already in terminal status FAILED. Only in-progress builds can be superseded. cause: null. The cancellation stays saved; retrying in 1920000ms.this service
2h 12m ago build remote stopCodexCoder21Organization/PerformanceTestServerServiceRemote stop attempt 9 for check run 123313394575 failed: foundation.url.protocol.sandbox.SandboxException: Sandboxed code threw an exception: java.lang.InternalError: Exception encountered in implementation of foundation/url/sjvm/intrinsics/ServiceBridge:rpc(Ljava/lang/String;Ljava/util/Map;)Ljava/util/Map; : foundation.url.resolver.UrlResolutionException: RPC request 'supersedeBuildRun' failed: RELAY_ERROR - Handler error: RPC error: INTERNAL_ERROR - Cannot supersede build run '9fec490a': it is already in terminal status COMPLETED. Only in-progress builds can be superseded. cause: null. The cancellation stays saved; retrying in 1920000ms.this service
2h 36m ago build remote stopCodexCoder21Organization/PerformanceTestServerServiceRemote stop attempt 8 for check run 123353019185 failed: foundation.url.protocol.sandbox.SandboxException: Sandboxed code threw an exception: java.lang.InternalError: Exception encountered in implementation of foundation/url/sjvm/intrinsics/ServiceBridge:rpc(Ljava/lang/String;Ljava/util/Map;)Ljava/util/Map; : foundation.url.resolver.UrlResolutionException: RPC request 'supersedeBuildRun' failed: RELAY_ERROR - Handler error: RPC error: INTERNAL_ERROR - Cannot supersede build run 'a4395125': it is already in terminal status FAILED. Only in-progress builds can be superseded. cause: null. The cancellation stays saved; retrying in 1920000ms.this service
2h 43m ago build remote stopCodexCoder21Organization/PerformanceTestServerServiceRemote stop attempt 9 for check run 123333491531 failed: foundation.url.protocol.sandbox.SandboxException: Sandboxed code threw an exception: java.lang.InternalError: Exception encountered in implementation of foundation/url/sjvm/intrinsics/ServiceBridge:rpc(Ljava/lang/String;Ljava/util/Map;)Ljava/util/Map; : foundation.url.resolver.UrlResolutionException: RPC request 'supersedeBuildRun' failed: RELAY_ERROR - Handler error: RPC error: INTERNAL_ERROR - Cannot supersede build run '14a9a396': it is already in terminal status COMPLETED. Only in-progress builds can be superseded. cause: null. The cancellation stays saved; retrying in 1920000ms.this service
2h 45m ago build remote stopCodexCoder21Organization/PerformanceTestServerServiceRemote stop attempt 6 for check run 123414784896 failed: foundation.url.protocol.sandbox.SandboxException: Sandboxed code threw an exception: java.lang.InternalError: Exception encountered in implementation of foundation/url/sjvm/intrinsics/ServiceBridge:rpc(Ljava/lang/String;Ljava/util/Map;)Ljava/util/Map; : foundation.url.resolver.UrlResolutionException: RPC request 'supersedeBuildRun' failed: RELAY_ERROR - Handler error: RPC error: INTERNAL_ERROR - Cannot supersede build run '36ae7182': it is already in terminal status FAILED. Only in-progress builds can be superseded. cause: null. The cancellation stays saved; retrying in 1920000ms.this service
2h 57m ago build remote stopCodexCoder21Organization/PerformanceTestServerServiceRemote stop attempt 8 for check run 123313394575 failed: foundation.url.protocol.sandbox.SandboxException: Sandboxed code threw an exception: java.lang.InternalError: Exception encountered in implementation of foundation/url/sjvm/intrinsics/ServiceBridge:rpc(Ljava/lang/String;Ljava/util/Map;)Ljava/util/Map; : foundation.url.resolver.UrlResolutionException: RPC request 'supersedeBuildRun' failed: RELAY_ERROR - Handler error: RPC error: INTERNAL_ERROR - Cannot supersede build run '9fec490a': it is already in terminal status COMPLETED. Only in-progress builds can be superseded. cause: null. The cancellation stays saved; retrying in 1920000ms.this service
3h 14m ago build remote stopCodexCoder21Organization/PerformanceTestServerServiceRemote stop attempt 5 for check run 123414784896 failed: foundation.url.protocol.sandbox.SandboxException: Sandboxed code threw an exception: java.lang.InternalError: Exception encountered in implementation of foundation/url/sjvm/intrinsics/ServiceBridge:rpc(Ljava/lang/String;Ljava/util/Map;)Ljava/util/Map; : foundation.url.resolver.UrlResolutionException: RPC request 'supersedeBuildRun' failed: RELAY_ERROR - Handler error: RPC error: INTERNAL_ERROR - Cannot supersede build run '36ae7182': it is already in terminal status FAILED. Only in-progress builds can be superseded. cause: null. The cancellation stays saved; retrying in 960000ms.this service
3h 24m ago build remote stopCodexCoder21Organization/PerformanceTestServerServiceRemote stop attempt 7 for check run 123353019185 failed: foundation.url.protocol.sandbox.SandboxException: Sandboxed code threw an exception: java.lang.InternalError: Exception encountered in implementation of foundation/url/sjvm/intrinsics/ServiceBridge:rpc(Ljava/lang/String;Ljava/util/Map;)Ljava/util/Map; : foundation.url.resolver.UrlResolutionException: RPC request 'supersedeBuildRun' failed: INTERNAL_ERROR - RPC error: INTERNAL_ERROR - Cannot supersede build run 'a4395125': it is already in terminal status FAILED. Only in-progress builds can be superseded. cause: null. The cancellation stays saved; retrying in 1920000ms.this service
3h 28m ago build remote stopCodexCoder21Organization/PerformanceTestServerServiceRemote stop attempt 8 for check run 123333491531 failed: foundation.url.protocol.sandbox.SandboxException: Sandboxed code threw an exception: java.lang.InternalError: Exception encountered in implementation of foundation/url/sjvm/intrinsics/ServiceBridge:rpc(Ljava/lang/String;Ljava/util/Map;)Ljava/util/Map; : foundation.url.resolver.UrlResolutionException: RPC request 'supersedeBuildRun' failed: INTERNAL_ERROR - RPC error: INTERNAL_ERROR - Cannot supersede build run '14a9a396': it is already in terminal status COMPLETED. Only in-progress builds can be superseded. cause: null. The cancellation stays saved; retrying in 1920000ms.this service
3h 36m ago build remote stopCodexCoder21Organization/PerformanceTestServerServiceRemote stop attempt 4 for check run 123414784896 failed: foundation.url.protocol.sandbox.SandboxException: Sandboxed code threw an exception: java.lang.InternalError: Exception encountered in implementation of foundation/url/sjvm/intrinsics/ServiceBridge:rpc(Ljava/lang/String;Ljava/util/Map;)Ljava/util/Map; : foundation.url.resolver.UrlResolutionException: RPC request 'supersedeBuildRun' failed: INTERNAL_ERROR - RPC error: INTERNAL_ERROR - Cannot supersede build run '36ae7182': it is already in terminal status FAILED. Only in-progress builds can be superseded. cause: null. The cancellation stays saved; retrying in 480000ms.this service
3h 45m ago build remote stopCodexCoder21Organization/PerformanceTestServerServiceRemote stop attempt 7 for check run 123313394575 failed: foundation.url.protocol.sandbox.SandboxException: Sandboxed code threw an exception: java.lang.InternalError: Exception encountered in implementation of foundation/url/sjvm/intrinsics/ServiceBridge:rpc(Ljava/lang/String;Ljava/util/Map;)Ljava/util/Map; : foundation.url.resolver.UrlResolutionException: RPC request 'supersedeBuildRun' failed: INTERNAL_ERROR - RPC error: INTERNAL_ERROR - Cannot supersede build run '9fec490a': it is already in terminal status COMPLETED. Only in-progress builds can be superseded. cause: null. The cancellation stays saved; retrying in 1920000ms.this service
3h 54m ago build remote stopCodexCoder21Organization/PerformanceTestServerServiceRemote stop attempt 3 for check run 123414784896 failed: foundation.url.protocol.sandbox.SandboxException: Sandboxed code threw an exception: java.lang.InternalError: Exception encountered in implementation of foundation/url/sjvm/intrinsics/ServiceBridge:rpc(Ljava/lang/String;Ljava/util/Map;)Ljava/util/Map; : foundation.url.resolver.UrlResolutionException: RPC request 'supersedeBuildRun' failed: INTERNAL_ERROR - RPC error: INTERNAL_ERROR - Cannot supersede build run '36ae7182': it is already in terminal status FAILED. Only in-progress builds can be superseded. cause: null. The cancellation stays saved; retrying in 240000ms.this service
4h 11m ago build remote stopCodexCoder21Organization/PerformanceTestServerServiceRemote stop attempt 6 for check run 123353019185 failed: foundation.url.protocol.sandbox.SandboxException: Sandboxed code threw an exception: java.lang.InternalError: Exception encountered in implementation of foundation/url/sjvm/intrinsics/ServiceBridge:rpc(Ljava/lang/String;Ljava/util/Map;)Ljava/util/Map; : foundation.url.resolver.UrlResolutionException: RPC request 'supersedeBuildRun' failed: INTERNAL_ERROR - RPC error: INTERNAL_ERROR - Cannot supersede build run 'a4395125': it is already in terminal status FAILED. Only in-progress builds can be superseded. cause: null. The cancellation stays saved; retrying in 1920000ms.this service
4h 19m ago build remote stopCodexCoder21Organization/PerformanceTestServerServiceRemote stop attempt 7 for check run 123333491531 failed: foundation.url.protocol.sandbox.SandboxException: Sandboxed code threw an exception: java.lang.InternalError: Exception encountered in implementation of foundation/url/sjvm/intrinsics/ServiceBridge:rpc(Ljava/lang/String;Ljava/util/Map;)Ljava/util/Map; : foundation.url.resolver.UrlResolutionException: RPC request 'supersedeBuildRun' failed: INTERNAL_ERROR - RPC error: INTERNAL_ERROR - Cannot supersede build run '14a9a396': it is already in terminal status COMPLETED. Only in-progress builds can be superseded. cause: null. The cancellation stays saved; retrying in 1920000ms.this service
6h 27m ago build remote stopCodexCoder21Organization/PerformanceTestServerServiceRemote stop attempt 6 for check run 123333491531 failed: foundation.url.protocol.sandbox.SandboxException: Sandboxed code threw an exception: java.lang.InternalError: Exception encountered in implementation of foundation/url/sjvm/intrinsics/ServiceBridge:rpc(Ljava/lang/String;Ljava/util/Map;)Ljava/util/Map; : foundation.url.resolver.UrlResolutionException: RPC request 'supersedeBuildRun' failed: INTERNAL_ERROR - RPC error: INTERNAL_ERROR - Cannot supersede build run '14a9a396': it is already in terminal status COMPLETED. Only in-progress builds can be superseded. cause: null. The cancellation stays saved; retrying in 1920000ms.this service
6h 45m ago build remote stopCodexCoder21Organization/PerformanceTestServerServiceRemote stop attempt 6 for check run 123313394575 failed: foundation.url.protocol.sandbox.SandboxException: Sandboxed code threw an exception: java.lang.InternalError: Exception encountered in implementation of foundation/url/sjvm/intrinsics/ServiceBridge:rpc(Ljava/lang/String;Ljava/util/Map;)Ljava/util/Map; : foundation.url.resolver.UrlResolutionException: RPC request 'supersedeBuildRun' failed: INTERNAL_ERROR - RPC error: INTERNAL_ERROR - Cannot supersede build run '9fec490a': it is already in terminal status COMPLETED. Only in-progress builds can be superseded. cause: null. The cancellation stays saved; retrying in 1920000ms.this service
6h 56m ago build remote stopCodexCoder21Organization/PerformanceTestServerServiceRemote stop attempt 5 for check run 123353019185 failed: foundation.url.protocol.sandbox.SandboxException: Sandboxed code threw an exception: java.lang.InternalError: Exception encountered in implementation of foundation/url/sjvm/intrinsics/ServiceBridge:rpc(Ljava/lang/String;Ljava/util/Map;)Ljava/util/Map; : foundation.url.resolver.UrlResolutionException: RPC request 'supersedeBuildRun' failed: INTERNAL_ERROR - RPC error: INTERNAL_ERROR - Cannot supersede build run 'a4395125': it is already in terminal status FAILED. Only in-progress builds can be superseded. cause: null. The cancellation stays saved; retrying in 960000ms.this service
7h 18m ago deliveryCodexCoder21Organization/PerformanceTestServerServiceGitHub delivered check_run.completed for CodexCoder21Organization/PerformanceTestServerService.codexcoder21
7h 18m ago deliveryCodexCoder21Organization/PerformanceTestServerServiceGitHub delivered check_run.completed for CodexCoder21Organization/PerformanceTestServerService.codexcoder21
7h 19m ago completedCodexCoder21Organization/PerformanceTestServerServiceBuild never started because the runner was saturated: every build worker was already running a check. It waited 1s in the deferred queue before the existing local deferred-submission deadline expired.this service
7h 19m ago completedCodexCoder21Organization/PerformanceTestServerServiceBuild never started because the runner was saturated: every build worker was already running a check. It waited 3s in the deferred queue before the existing local deferred-submission deadline expired.this service
7h 26m ago build remote stopCodexCoder21Organization/PerformanceTestServerServiceRemote stop attempt 2 for check run 123414784896 failed: foundation.url.protocol.sandbox.SandboxException: Sandboxed code threw an exception: java.lang.InternalError: Exception encountered in implementation of foundation/url/sjvm/intrinsics/ServiceBridge:rpc(Ljava/lang/String;Ljava/util/Map;)Ljava/util/Map; : foundation.url.resolver.UrlResolutionException: RPC request 'supersedeBuildRun' failed: INTERNAL_ERROR - RPC error: INTERNAL_ERROR - Cannot supersede build run '36ae7182': it is already in terminal status FAILED. Only in-progress builds can be superseded. cause: null. The cancellation stays saved; retrying in 120000ms.this service
7h 37m ago build remote stopCodexCoder21Organization/PerformanceTestServerServiceRemote stop attempt 4 for check run 123353019185 failed: foundation.url.protocol.sandbox.SandboxException: Sandboxed code threw an exception: java.lang.InternalError: Exception encountered in implementation of foundation/url/sjvm/intrinsics/ServiceBridge:rpc(Ljava/lang/String;Ljava/util/Map;)Ljava/util/Map; : foundation.url.resolver.UrlResolutionException: RPC request 'supersedeBuildRun' failed: INTERNAL_ERROR - RPC error: INTERNAL_ERROR - Cannot supersede build run 'a4395125': it is already in terminal status FAILED. Only in-progress builds can be superseded. cause: null. The cancellation stays saved; retrying in 480000ms.this service
7h 40m ago build remote stopCodexCoder21Organization/PerformanceTestServerServiceRemote stop attempt 5 for check run 123333491531 failed: foundation.url.protocol.sandbox.SandboxException: Sandboxed code threw an exception: java.lang.InternalError: Exception encountered in implementation of foundation/url/sjvm/intrinsics/ServiceBridge:rpc(Ljava/lang/String;Ljava/util/Map;)Ljava/util/Map; : foundation.url.resolver.UrlResolutionException: RPC request 'supersedeBuildRun' failed: INTERNAL_ERROR - RPC error: INTERNAL_ERROR - Cannot supersede build run '14a9a396': it is already in terminal status COMPLETED. Only in-progress builds can be superseded. cause: null. The cancellation stays saved; retrying in 960000ms.this service
7h 43m ago build remote stopCodexCoder21Organization/PerformanceTestServerServiceRemote stop attempt 5 for check run 123313394575 failed: foundation.url.protocol.sandbox.SandboxException: Sandboxed code threw an exception: java.lang.InternalError: Exception encountered in implementation of foundation/url/sjvm/intrinsics/ServiceBridge:rpc(Ljava/lang/String;Ljava/util/Map;)Ljava/util/Map; : foundation.url.resolver.UrlResolutionException: RPC request 'supersedeBuildRun' failed: INTERNAL_ERROR - RPC error: INTERNAL_ERROR - Cannot supersede build run '9fec490a': it is already in terminal status COMPLETED. Only in-progress builds can be superseded. cause: null. The cancellation stays saved; retrying in 960000ms.this service
7h 45m ago deliveryCodexCoder21Organization/PerformanceTestServerServiceGitHub delivered check_run.completed for CodexCoder21Organization/PerformanceTestServerService.codexcoder21
7h 46m ago completedCodexCoder21Organization/PerformanceTestServerServiceBuild never started because the runner was saturated: every build worker was already running a check. It waited 3s in the deferred queue before the existing local deferred-submission deadline expired.this service