kotlin.build CI

Trigger log

Every delivery GitHub sent and what this service did with it — including the ones that produced no build. Newest first.

WhenWhatRepositoryDetailWho
12m 33s ago build remote stopCodexCoder21Organization/TinySiteWuiRemote stop attempt 12 for check run 123189304018 failed: foundation.url.protocol.sandbox.SandboxException: Sandboxed code threw an exception: java.lang.InternalError: Exception encountered in implementation of foundation/url/sjvm/intrinsics/ServiceBridge:rpc(Ljava/lang/String;Ljava/util/Map;)Ljava/util/Map; : foundation.url.resolver.UrlResolutionException: RPC request 'supersedeBuildRun' failed: RELAY_ERROR - Handler error: RPC error: INTERNAL_ERROR - Cannot supersede build run 'db6bbf24': it is already in terminal status FAILED. Only in-progress builds can be superseded. cause: null. The cancellation stays saved; retrying in 1920000ms.this service
58m 25s ago build remote stopCodexCoder21Organization/TinySiteWuiRemote stop attempt 11 for check run 123189304018 failed: foundation.url.protocol.sandbox.SandboxException: Sandboxed code threw an exception: java.lang.InternalError: Exception encountered in implementation of foundation/url/sjvm/intrinsics/ServiceBridge:rpc(Ljava/lang/String;Ljava/util/Map;)Ljava/util/Map; : foundation.url.resolver.UrlResolutionException: RPC request 'supersedeBuildRun' failed: RELAY_ERROR - Handler error: RPC error: INTERNAL_ERROR - Cannot supersede build run 'db6bbf24': it is already in terminal status FAILED. Only in-progress builds can be superseded. cause: null. The cancellation stays saved; retrying in 1920000ms.this service
1h 11m ago build recovery failedCodexCoder21Organization/TinySiteWuiFailed to recover shadow check 118989001763: foundation.url.protocol.sandbox.SandboxException: Sandboxed code threw an exception: java.lang.InternalError: Exception encountered in implementation of foundation/url/sjvm/intrinsics/ServiceBridge:rpc(Ljava/lang/String;Ljava/util/Map;)Ljava/util/Map; : foundation.url.resolver.UrlResolutionException: RPC request 'finalizeUpload' failed: INTERNAL_ERROR - RPC error: -1 - IllegalStateException: Cannot run CI operation 'finalizeUpload' because the url://buildtest/ connection has not been established, and it did not come up within 20000ms of waiting. Retry once the server logs 'url://buildtest/ connection established; ingestion and CI orchestration enabled.' cause: null at foundation.url.resolver.sandbox.TypeMarshaling.fromJvmResult$foundation_url_resolver_sandbox(TypeMarshaling.kt:692) at foundation.url.resolver.sandbox.InstanceMethodDispatcher$invokeWithActivity$3.invoke(SandboxedProxyGenerator.kt:2106) at foundation.url.resolver.sandbox.InstanceMethodDispatcher$invokeWithActivity$3.invoke(SandboxedProxyGenerator.kt:2037) at foundation.url.resolver.sandbox.SandboxedProxyGeneratorKt$invokeSandboxMethod$future$1$result$1.invoke(SandboxedProxyGenerator.kt:1491) at community.kotlin.clocks.hierarchical.RequiredClockPadKt.withRequiredClockPad(RequiredClockPad.kt:89) at foundation.url.resolver.sandbox.SandboxedProxyGeneratorKt.invokeSandboxMethod$lambda$4(SandboxedProxyGenerator.kt:1491) at java.base/java.util.concurrent.FutureTask.run(FutureTask.java:317) at foundation.url.resolver.sandbox.SandboxInvocationLane.runScheduled(SandboxedProxyGenerator.kt:1379) at foundation.url.resolver.sandbox.SandboxInvocationLane.schedule$lambda$5(SandboxedProxyGenerator.kt:1370) at java.base/java.util.concurrent.ThreadPoolExecutor.runWorker(ThreadPoolExecutor.java:1144) at java.base/java.util.concurrent.ThreadPoolExecutor$Worker.run(ThreadPoolExecutor.java:642) at java.base/java.lang.Thread.run(Thread.java:1583) Caused by: java.lang.RuntimeException: java.lang.InternalError: Exception encountered in implementation of foundation/url/sjvm/intrinsics/ServiceBridge:rpc(Ljava/lang/String;Ljava/util/Map;)Ljava/util/Map; : foundation.url.resolver.UrlResolutionException: RPC request 'finalizeUpload' failed: INTERNAL_ERROR - RPC error: -1 - IllegalStateException: Cannot run CI operation 'finalizeUpload' because the url://buildtest/ connection has not been established, and it did not come up within 20000ms of waiting. Retry once the server logs 'url://buildtest/ connection established; ingestion and CI orchestration enabled.' at foundation.url.resolver.sandbox.TypeMarshaling.fromJvmResult$foundation_url_resolver_sandbox(TypeMarshaling.kt:695) ... 11 more this service
1h 44m ago build recovery failedCodexCoder21Organization/TinySiteWuiFailed to recover shadow check 118967921886: foundation.url.protocol.sandbox.SandboxException: Sandboxed code threw an exception: java.lang.InternalError: Exception encountered in implementation of foundation/url/sjvm/intrinsics/ServiceBridge:rpc(Ljava/lang/String;Ljava/util/Map;)Ljava/util/Map; : foundation.url.resolver.UrlResolutionException: RPC request 'finalizeUpload' failed: INTERNAL_ERROR - RPC error: -1 - IllegalStateException: Cannot run CI operation 'finalizeUpload' because the url://buildtest/ connection has not been established, and it did not come up within 20000ms of waiting. Retry once the server logs 'url://buildtest/ connection established; ingestion and CI orchestration enabled.' cause: null at foundation.url.resolver.sandbox.TypeMarshaling.fromJvmResult$foundation_url_resolver_sandbox(TypeMarshaling.kt:692) at foundation.url.resolver.sandbox.InstanceMethodDispatcher$invokeWithActivity$3.invoke(SandboxedProxyGenerator.kt:2106) at foundation.url.resolver.sandbox.InstanceMethodDispatcher$invokeWithActivity$3.invoke(SandboxedProxyGenerator.kt:2037) at foundation.url.resolver.sandbox.SandboxedProxyGeneratorKt$invokeSandboxMethod$future$1$result$1.invoke(SandboxedProxyGenerator.kt:1491) at community.kotlin.clocks.hierarchical.RequiredClockPadKt.withRequiredClockPad(RequiredClockPad.kt:89) at foundation.url.resolver.sandbox.SandboxedProxyGeneratorKt.invokeSandboxMethod$lambda$4(SandboxedProxyGenerator.kt:1491) at java.base/java.util.concurrent.FutureTask.run(FutureTask.java:317) at foundation.url.resolver.sandbox.SandboxInvocationLane.runScheduled(SandboxedProxyGenerator.kt:1379) at foundation.url.resolver.sandbox.SandboxInvocationLane.schedule$lambda$5(SandboxedProxyGenerator.kt:1370) at java.base/java.util.concurrent.ThreadPoolExecutor.runWorker(ThreadPoolExecutor.java:1144) at java.base/java.util.concurrent.ThreadPoolExecutor$Worker.run(ThreadPoolExecutor.java:642) at java.base/java.lang.Thread.run(Thread.java:1583) Caused by: java.lang.RuntimeException: java.lang.InternalError: Exception encountered in implementation of foundation/url/sjvm/intrinsics/ServiceBridge:rpc(Ljava/lang/String;Ljava/util/Map;)Ljava/util/Map; : foundation.url.resolver.UrlResolutionException: RPC request 'finalizeUpload' failed: INTERNAL_ERROR - RPC error: -1 - IllegalStateException: Cannot run CI operation 'finalizeUpload' because the url://buildtest/ connection has not been established, and it did not come up within 20000ms of waiting. Retry once the server logs 'url://buildtest/ connection established; ingestion and CI orchestration enabled.' at foundation.url.resolver.sandbox.TypeMarshaling.fromJvmResult$foundation_url_resolver_sandbox(TypeMarshaling.kt:695) ... 11 more this service
1h 47m ago build remote stopCodexCoder21Organization/TinySiteWuiRemote stop attempt 10 for check run 123189304018 failed: foundation.url.protocol.sandbox.SandboxException: Sandboxed code threw an exception: java.lang.InternalError: Exception encountered in implementation of foundation/url/sjvm/intrinsics/ServiceBridge:rpc(Ljava/lang/String;Ljava/util/Map;)Ljava/util/Map; : foundation.url.resolver.UrlResolutionException: RPC request 'supersedeBuildRun' failed: RELAY_ERROR - Handler error: RPC error: INTERNAL_ERROR - Cannot supersede build run 'db6bbf24': it is already in terminal status FAILED. Only in-progress builds can be superseded. cause: null. The cancellation stays saved; retrying in 1920000ms.this service
2h 37m ago build remote stopCodexCoder21Organization/TinySiteWuiRemote stop attempt 9 for check run 123189304018 failed: foundation.url.protocol.sandbox.SandboxException: Sandboxed code threw an exception: java.lang.InternalError: Exception encountered in implementation of foundation/url/sjvm/intrinsics/ServiceBridge:rpc(Ljava/lang/String;Ljava/util/Map;)Ljava/util/Map; : foundation.url.resolver.UrlResolutionException: RPC request 'supersedeBuildRun' failed: RELAY_ERROR - Handler error: RPC error: INTERNAL_ERROR - Cannot supersede build run 'db6bbf24': it is already in terminal status FAILED. Only in-progress builds can be superseded. cause: null. The cancellation stays saved; retrying in 1920000ms.this service
3h 27m ago build remote stopCodexCoder21Organization/TinySiteWuiRemote stop attempt 8 for check run 123189304018 failed: foundation.url.protocol.sandbox.SandboxException: Sandboxed code threw an exception: java.lang.InternalError: Exception encountered in implementation of foundation/url/sjvm/intrinsics/ServiceBridge:rpc(Ljava/lang/String;Ljava/util/Map;)Ljava/util/Map; : foundation.url.resolver.UrlResolutionException: RPC request 'supersedeBuildRun' failed: INTERNAL_ERROR - RPC error: INTERNAL_ERROR - Cannot supersede build run 'db6bbf24': it is already in terminal status FAILED. Only in-progress builds can be superseded. cause: null. The cancellation stays saved; retrying in 1920000ms.this service
4h 14m ago build remote stopCodexCoder21Organization/TinySiteWuiRemote stop attempt 7 for check run 123189304018 failed: foundation.url.protocol.sandbox.SandboxException: Sandboxed code threw an exception: java.lang.InternalError: Exception encountered in implementation of foundation/url/sjvm/intrinsics/ServiceBridge:rpc(Ljava/lang/String;Ljava/util/Map;)Ljava/util/Map; : foundation.url.resolver.UrlResolutionException: RPC request 'supersedeBuildRun' failed: INTERNAL_ERROR - RPC error: INTERNAL_ERROR - Cannot supersede build run 'db6bbf24': it is already in terminal status FAILED. Only in-progress builds can be superseded. cause: null. The cancellation stays saved; retrying in 1920000ms.this service
4h 43m ago deliveryCodexCoder21Organization/TinySiteWuiGitHub delivered check_run.completed for CodexCoder21Organization/TinySiteWui.codexcoder21
4h 43m ago deliveryCodexCoder21Organization/TinySiteWuiGitHub delivered check_suite.completed for CodexCoder21Organization/TinySiteWui.codexcoder21
6h 54m ago build remote stopCodexCoder21Organization/TinySiteWuiRemote stop attempt 6 for check run 123189304018 failed: foundation.url.protocol.sandbox.SandboxException: Sandboxed code threw an exception: java.lang.InternalError: Exception encountered in implementation of foundation/url/sjvm/intrinsics/ServiceBridge:rpc(Ljava/lang/String;Ljava/util/Map;)Ljava/util/Map; : foundation.url.resolver.UrlResolutionException: RPC request 'supersedeBuildRun' failed: INTERNAL_ERROR - RPC error: INTERNAL_ERROR - Cannot supersede build run 'db6bbf24': it is already in terminal status FAILED. Only in-progress builds can be superseded. cause: null. The cancellation stays saved; retrying in 1920000ms.this service
6h 58m ago deliveryCodexCoder21Organization/TinySiteWuiGitHub delivered check_run.completed for CodexCoder21Organization/TinySiteWui.codexcoder21
6h 58m ago completedCodexCoder21Organization/TinySiteWuiAll tests passing (419/419)this service
7h 30m ago deliveryCodexCoder21Organization/TinySiteWuiGitHub delivered check_run.completed for CodexCoder21Organization/TinySiteWui.codexcoder21
7h 30m ago completedCodexCoder21Organization/TinySiteWuiBuild never started because the runner was saturated: every build worker was already running a check. It waited 17s in the deferred queue before the existing local deferred-submission deadline expired.this service
7h 31m ago build pendingCodexCoder21Organization/TinySiteWuiRemote run c024281c remains PENDING after 225192s of queue wait; waiting for buildtest admission.this service
7h 37m ago build pendingCodexCoder21Organization/TinySiteWuiRemote run c024281c remains PENDING after 224850s of queue wait; waiting for buildtest admission.this service
7h 39m ago build remote stopCodexCoder21Organization/TinySiteWuiRemote stop attempt 5 for check run 123189304018 failed: foundation.url.protocol.sandbox.SandboxException: Sandboxed code threw an exception: java.lang.InternalError: Exception encountered in implementation of foundation/url/sjvm/intrinsics/ServiceBridge:rpc(Ljava/lang/String;Ljava/util/Map;)Ljava/util/Map; : foundation.url.resolver.UrlResolutionException: RPC request 'supersedeBuildRun' failed: INTERNAL_ERROR - RPC error: INTERNAL_ERROR - Cannot supersede build run 'db6bbf24': it is already in terminal status FAILED. Only in-progress builds can be superseded. cause: null. The cancellation stays saved; retrying in 960000ms.this service
7h 44m ago build pendingCodexCoder21Organization/TinySiteWuiRemote run c024281c remains PENDING after 224446s of queue wait; waiting for buildtest admission.this service
7h 48m ago deliveryCodexCoder21Organization/TinySiteWuiGitHub delivered check_run.completed for CodexCoder21Organization/TinySiteWui.codexcoder21
7h 48m ago completedCodexCoder21Organization/TinySiteWuiBuild never started because the runner was saturated: every build worker was already running a check. It waited 1s in the deferred queue before the existing local deferred-submission deadline expired.this service
7h 49m ago build pendingCodexCoder21Organization/TinySiteWuiRemote run c024281c remains PENDING after 224108s of queue wait; waiting for buildtest admission.this service
7h 52m ago deliveryCodexCoder21Organization/TinySiteWuiGitHub delivered check_run.completed for CodexCoder21Organization/TinySiteWui.codexcoder21
7h 53m ago completedCodexCoder21Organization/TinySiteWuiBuild never started because the runner was saturated: every build worker was already running a check. It waited 0s in the deferred queue before the existing local deferred-submission deadline expired.this service
7h 55m ago build pendingCodexCoder21Organization/TinySiteWuiRemote run c024281c remains PENDING after 223776s of queue wait; waiting for buildtest admission.this service
7h 57m ago deliveryCodexCoder21Organization/TinySiteWuiGitHub delivered check_run.completed for CodexCoder21Organization/TinySiteWui.codexcoder21
7h 59m ago completedCodexCoder21Organization/TinySiteWuiBuild never started because the runner was saturated: every build worker was already running a check. It waited 3s in the deferred queue before the existing local deferred-submission deadline expired.this service
7h 59m ago deliveryCodexCoder21Organization/TinySiteWuiGitHub delivered check_run.completed for CodexCoder21Organization/TinySiteWui.codexcoder21
7h 59m ago completedCodexCoder21Organization/TinySiteWuiBuild never started because the runner was saturated: every build worker was already running a check. It waited 60s in the deferred queue before the existing local deferred-submission deadline expired.this service
8h 1m ago deliveryCodexCoder21Organization/TinySiteWuiGitHub delivered check_run.completed for CodexCoder21Organization/TinySiteWui.codexcoder21
8h 1m ago completedCodexCoder21Organization/TinySiteWuiBuild never started because the runner was saturated: every build worker was already running a check. It waited 0s in the deferred queue before the existing local deferred-submission deadline expired.this service
8h 3m ago build pendingCodexCoder21Organization/TinySiteWuiRemote run c024281c remains PENDING after 223304s of queue wait; waiting for buildtest admission.this service
8h 9m ago build pendingCodexCoder21Organization/TinySiteWuiRemote run c024281c remains PENDING after 222905s of queue wait; waiting for buildtest admission.this service
8h 15m ago build pendingCodexCoder21Organization/TinySiteWuiRemote run c024281c remains PENDING after 222595s of queue wait; waiting for buildtest admission.this service
8h 18m ago build remote stopCodexCoder21Organization/TinySiteWuiRemote stop attempt 4 for check run 123189304018 failed: foundation.url.protocol.sandbox.SandboxException: Sandboxed code threw an exception: java.lang.InternalError: Exception encountered in implementation of foundation/url/sjvm/intrinsics/ServiceBridge:rpc(Ljava/lang/String;Ljava/util/Map;)Ljava/util/Map; : foundation.url.resolver.UrlResolutionException: RPC request 'supersedeBuildRun' failed: INTERNAL_ERROR - RPC error: INTERNAL_ERROR - Cannot supersede build run 'db6bbf24': it is already in terminal status FAILED. Only in-progress builds can be superseded. cause: null. The cancellation stays saved; retrying in 480000ms.this service
8h 18m ago build remote stopCodexCoder21Organization/TinySiteWuiRemote stop attempt 3 for check run 123189304018 failed: foundation.url.protocol.sandbox.SandboxException: Sandboxed code threw an exception: java.lang.InternalError: Exception encountered in implementation of foundation/url/sjvm/intrinsics/ServiceBridge:rpc(Ljava/lang/String;Ljava/util/Map;)Ljava/util/Map; : foundation.url.resolver.UrlResolutionException: RPC request 'supersedeBuildRun' failed: INTERNAL_ERROR - RPC error: INTERNAL_ERROR - Cannot supersede build run 'db6bbf24': it is already in terminal status FAILED. Only in-progress builds can be superseded. cause: null. The cancellation stays saved; retrying in 240000ms.this service
8h 20m ago build pendingCodexCoder21Organization/TinySiteWuiRemote run c024281c remains PENDING after 222267s of queue wait; waiting for buildtest admission.this service
8h 22m ago deliveryCodexCoder21Organization/TinySiteWuiGitHub delivered check_run.completed for CodexCoder21Organization/TinySiteWui.codexcoder21
8h 22m ago deliveryCodexCoder21Organization/TinySiteWuiGitHub delivered check_suite.completed for CodexCoder21Organization/TinySiteWui.codexcoder21
8h 23m ago completedCodexCoder21Organization/TinySiteWuiA newer commit was pushed to PR #31, so this build is no longer current and was stopped. The check for the new commit reports the result that counts.this service
8h 23m ago deliveryCodexCoder21Organization/TinySiteWuiGitHub delivered check_suite.completed for CodexCoder21Organization/TinySiteWui.codexcoder21
8h 23m ago deliveryCodexCoder21Organization/TinySiteWuiGitHub delivered check_run.completed for CodexCoder21Organization/TinySiteWui.codexcoder21
8h 23m ago completedCodexCoder21Organization/TinySiteWuiA newer commit was pushed to PR #31, so this build is no longer current and was stopped. The check for the new commit reports the result that counts.this service
8h 25m ago build pendingCodexCoder21Organization/TinySiteWuiRemote run c024281c remains PENDING after 221939s of queue wait; waiting for buildtest admission.this service
8h 25m ago deliveryCodexCoder21Organization/TinySiteWuiGitHub delivered check_run.completed for CodexCoder21Organization/TinySiteWui.codexcoder21
8h 25m ago deliveryCodexCoder21Organization/TinySiteWuiGitHub delivered check_suite.completed for CodexCoder21Organization/TinySiteWui.codexcoder21
8h 26m ago completedCodexCoder21Organization/TinySiteWuiBuild never started because the runner was saturated: every build worker was already running a check. It waited 52s in the deferred queue before the existing local deferred-submission deadline expired.this service
8h 31m ago build pendingCodexCoder21Organization/TinySiteWuiRemote run c024281c remains PENDING after 221624s of queue wait; waiting for buildtest admission.this service
8h 36m ago build pendingCodexCoder21Organization/TinySiteWuiRemote run c024281c remains PENDING after 221296s of queue wait; waiting for buildtest admission.this service
8h 41m ago build pendingCodexCoder21Organization/TinySiteWuiRemote run c024281c remains PENDING after 220981s of queue wait; waiting for buildtest admission.this service
8h 42m ago deliveryCodexCoder21Organization/TinySiteWuiGitHub delivered check_run.completed for CodexCoder21Organization/TinySiteWui.codexcoder21
8h 42m ago deliveryCodexCoder21Organization/TinySiteWuiGitHub delivered check_suite.completed for CodexCoder21Organization/TinySiteWui.codexcoder21
8h 42m ago completedCodexCoder21Organization/TinySiteWuiBuild never started because the runner was saturated: every build worker was already running a check. It waited 2s in the deferred queue before the existing local deferred-submission deadline expired.this service
8h 42m ago deliveryCodexCoder21Organization/TinySiteWuiGitHub delivered check_run.completed for CodexCoder21Organization/TinySiteWui.codexcoder21
8h 42m ago deliveryCodexCoder21Organization/TinySiteWuiGitHub delivered check_suite.completed for CodexCoder21Organization/TinySiteWui.codexcoder21
8h 43m ago completedCodexCoder21Organization/TinySiteWuiBuild never started because the runner was saturated: every build worker was already running a check. It waited 2s in the deferred queue before the existing local deferred-submission deadline expired.this service
8h 56m ago deliveryCodexCoder21Organization/TinySiteWuiGitHub delivered check_run.completed for CodexCoder21Organization/TinySiteWui.codexcoder21
8h 56m ago completedCodexCoder21Organization/TinySiteWuiBuild failed: 337 passed, 82 failed, 419 totalthis service
10h 28m ago deliveryCodexCoder21Organization/TinySiteWuiGitHub delivered check_suite.completed for CodexCoder21Organization/TinySiteWui.codexcoder21
10h 28m ago deliveryCodexCoder21Organization/TinySiteWuiGitHub delivered check_run.completed for CodexCoder21Organization/TinySiteWui.codexcoder21
10h 30m ago deliveryCodexCoder21Organization/TinySiteWuiGitHub delivered check_run.completed for CodexCoder21Organization/TinySiteWui.codexcoder21
10h 31m ago completedCodexCoder21Organization/TinySiteWuiBuild infrastructure error: foundation.url.protocol.sandbox.SandboxException: Cannot invoke method on closed instance proxy: buildtest/api/BuildRunImpl.getRunId()Ljava/lang/String;this service
10h 33m ago deliveryCodexCoder21Organization/TinySiteWuiGitHub delivered check_run.created for CodexCoder21Organization/TinySiteWui.codexcoder21
10h 35m ago dispatchedCodexCoder21Organization/TinySiteWuiSubmitted to the direct-buildtest build service.this service
10h 35m ago deliveryCodexCoder21Organization/TinySiteWuiGitHub delivered check_run.created for CodexCoder21Organization/TinySiteWui.codexcoder21
10h 42m ago deliveryCodexCoder21Organization/TinySiteWuiGitHub delivered check_run.completed for CodexCoder21Organization/TinySiteWui.codexcoder21
10h 44m ago completedCodexCoder21Organization/TinySiteWuiBuild never started because the runner was saturated: every build worker was already running a check. It waited 113s in the deferred queue before the existing local deferred-submission deadline expired.this service